{"text_format":"1","workbook":"xlsx","n_sheets":12,"sheets":["Einstieg","Tab_1","Tab_2","Tab_3","Tab_4","Tab_5","Steuer","Roh","Berechnung","Merkmale","Berufsausbildung","Geschlecht"],"not_rendered":{"charts":14,"images":33,"macros":1,"external_links":1,"defined_names":46,"comments":0,"pivot_tables":0},"unopened":[],"bounds":{"document_bytes":16777216,"sheet_cells":100000,"rows_first":2000,"rows_last":500,"rows_between":2000,"halvings":0,"cell_chars":16384,"cell_head_chars":4096},"cells_cut":0,"cells_raw":0,"read":"whole","date_system":"1900"}

{"sheet":"Einstieg","index":0,"n_rows":35,"n_cols":15,"rows_kept":35,"cut":false,"hidden":false,"merged":[]}
[]
[]
[]
[]
[]
[null,null,null,"Übertrittsrisiko in Langzeitarbeitslosigkeit (LZA-Übertrittsrisiko)"]
[null,null,null,"Das LZA-Übertrittsrisiko bringt zum Ausdruck, wie groß das Risiko ist, nach dem Zugang in Arbeitslosigkeit 12 Monate später langzeitarbeitslos zu werden."]
[]
[]
[]
[]
[]
[]
[]
[]
[]
[]
[]
[]
[]
[]
[]
[]
[]
[]
[]
[]
[]
[]
[]
[]
[]
[]
[]
[null,null,null,null,null,null,null,null,null,null,null,null,null,null,"© Statistik der Bundesagentur für Arbeit  "]

{"sheet":"Tab_1","index":1,"n_rows":46,"n_cols":17,"rows_kept":46,"cut":false,"hidden":false,"merged":[[10,11,13,15],[42,12,43,15],[40,12,41,15],[15,11,17,15],[33,11,35,15],[20,11,28,15]]}
[]
[]
[]
[]
[]
[null,null,null,"Übertrittsrisiko in Langzeitarbeitslosigkeit"]
[null,null,null,{"$f":"Steuer!A2","v":"2022 / 2023"}]
[null,null,null,{"$f":"Steuer!C5","v":"Deutschland"}]
[null,null,null,{"$f":"Steuer!J23","v":"Ausgewählte Merkmale: Für die Merkmale Rechtskreis im Zugang, Geschlecht, Alter, Staatsangehörigkeit und Berufsausbildung wurde keine Auswahl getroffen."}]
[null,null,null,"Vergleich über Risikoklassen allen Regionen"]
[null,null,null,null,null,null,null,null,null,null,null,{"$f":"Steuer!J10","v":"Das Risiko für die ausgewählte Merkmalsgruppe in der Region Deutschland liegt bei 14,3%. Bezogen auf alle Regionen und alle Merkmalsgruppen wird das Risiko in die Risikoklasse \"mittel\" eingeordnet."}]
[]
[]
[]
[]
[null,null,null,null,null,null,null,null,null,null,null,"Wenn Personen der ausgewählten Gruppe in der ausgewählten Region in Arbeitslosigkeit zugehen, haben sie das oben genannte Risiko, langzeitarbeitslos zu werden."]
[]
[]
[]
[null,null,null,null,null,null,null,null,null,null,null,"Bildung der Risikoklassen"]
[null,null,null,null,null,null,null,null,null,null,null,"Es können maximal 120 Merkmalsgruppen in fünf Großregionen unterschieden werden. Das Übertrittsrisiko wird für Merkmalsgruppen mit mindestens 20 Zugängen in Arbeitslosigkeit berechnet. Über alle Regionen stehen Angaben zu 592 Merkmalsgruppen zur Verfügung. Die Merkmalsgruppen werden nach der Höhe des Übertrittsrisikos aufsteigend sortiert und gleichmäßig auf fünf Risikogruppen verteilt. Ein sehr niedriges (hohes) Risiko einer Merkmalsgruppe bedeutet also ein sehr niedriges (hohes) Risiko im Vergleich zu allen anderen Merkmalsgruppen. "]
[]
[]
[]
[]
[]
[]
[]
[]
[null,null,null,null,null,null,null,null,null,null,null,{"$f":"Steuer!C5","v":"Deutschland"}]
[null,null,null,null,null,null,null,null,null,null,null,"Risiko",null,{"$f":"IFERROR((TEXT(Berechnung!Q21,\"#0,0\")&IF(Berechnung!Q21=\"k.A.\",\"\",\"%\")),\"k.A.\")","v":"14,3%"},{"$f":"IF(ISERROR(Berechnung!O22),\"\",Berechnung!O30)","v":"mittel"}]
[null,null,null,null,null,null,null,null,null,null,null,"Zugänge (ohne Unterbrecher)",null,{"$f":"TEXT(Steuer!O4,\"#.###\")","v":"4.594.317"}]
[null,null,null,null,null,null,null,null,null,null,null,"Übertritte",null,{"$f":"TEXT(Steuer!P4,\"#.###\")","v":"657.480"}]
[null,null,null,null,null,null,null,null,null,null,null,{"$f":"IF(OR(Steuer!O4=\"*\",Steuer!P4=\"*\"),Steuer!J16,\"\")","v":""}]
[]
[]
[null,null,null,null,null,null,null,null,null,null,null,"Hinweis Regionen"]
[null,null,null,null,null,null,null,null,null,null,null,"Süddeutschland","Bayern, Baden-Württemberg"]
[null,null,null,null,null,null,null,null,null,null,null,"Südwestdeutschland","Rheinland-Pfalz, Saarland, Hessen"]
[null,null,null,null,null,null,null,null,null,null,null,"Nordrhein-Westfalen","Nordrhein-Westfalen"]
[null,null,null,null,null,null,null,null,null,null,null,"Nordeutschland","Niedersachen, Bremen, Hamburg,\nSchleswig-Holstein"]
[]
[null,null,null,"n ist die Anzahl der Merkmale, die für die Berechnung der Risikoklassen verwendet werden konnten",null,null,null,null,null,null,null,"Ostdeutschland","Thüringen, Sachsen, Sachsen-Anhalt, Brandenburg, Berlin, Mecklenburg-Vorpommern"]
[]
[]
[null,null,null,null,null,null,null,null,null,null,null,null,null,null,null,null,"© Statistik der Bundesagentur für Arbeit  "]

{"sheet":"Tab_2","index":2,"n_rows":46,"n_cols":15,"rows_kept":46,"cut":false,"hidden":false,"merged":[]}
[]
[]
[]
[]
[]
[null,null,null,"Übertrittsrisiko in Langzeitarbeitslosigkeit nach Alter in Prozent"]
[null,null,null,{"$f":"Steuer!A2","v":"2022 / 2023"}]
[null,null,null,{"$f":"Steuer!C5","v":"Deutschland"}]
[]
[]
[]
[]
[]
[]
[]
[]
[]
[]
[]
[]
[]
[]
[]
[]
[]
[]
[]
[]
[]
[]
[]
[]
[]
[]
[]
[]
[]
[]
[]
[]
[]
[]
[]
[]
[]
[null,null,null,null,null,null,null,null,null,null,null,null,null,null,"© Statistik der Bundesagentur für Arbeit  "]

{"sheet":"Tab_3","index":3,"n_rows":46,"n_cols":15,"rows_kept":46,"cut":false,"hidden":false,"merged":[[5,3,5,14]]}
[]
[]
[]
[]
[]
[null,null,null,{"$f":"CONCATENATE(\"Übertrittsrisiko in Langzeitarbeitslosigkeit nach Alter und \",Berufsausbildung!$B$7,\" in Prozent\")","v":"Übertrittsrisiko in Langzeitarbeitslosigkeit nach Alter und Rechtskreis im Zugang in Prozent"}]
[null,null,null,{"$f":"Steuer!A2","v":"2022 / 2023"}]
[null,null,null,{"$f":"Steuer!C5","v":"Deutschland"}]
[]
[]
[]
[]
[]
[]
[]
[]
[]
[]
[]
[]
[]
[]
[]
[]
[]
[]
[]
[]
[]
[]
[]
[]
[]
[]
[]
[]
[]
[]
[]
[]
[]
[]
[]
[]
[]
[null,null,null,null,null,null,null,null,null,null,null,null,null,null,"© Statistik der Bundesagentur für Arbeit  "]

{"sheet":"Tab_4","index":4,"n_rows":28,"n_cols":15,"rows_kept":28,"cut":false,"hidden":false,"merged":[[5,3,5,14]]}
[]
[]
[]
[]
[]
[null,null,null,{"$f":"CONCATENATE(\"Übertrittsrisiko in Langzeitarbeitslosigkeit nach Geschlecht und \",Geschlecht!$B$7,\" in Prozent\")","v":"Übertrittsrisiko in Langzeitarbeitslosigkeit nach Geschlecht und Rechtskreis im Zugang in Prozent"}]
[null,null,null,{"$f":"Steuer!A2","v":"2022 / 2023"}]
[null,null,null,{"$f":"Steuer!C5","v":"Deutschland"}]
[]
[]
[]
[]
[]
[]
[]
[]
[]
[]
[]
[]
[]
[]
[]
[]
[]
[]
[]
[null,null,null,null,null,null,null,null,null,null,null,null,null,null,"© Statistik der Bundesagentur für Arbeit  "]

{"sheet":"Tab_5","index":5,"n_rows":44,"n_cols":18,"rows_kept":44,"cut":false,"hidden":false,"merged":[[26,12,26,16],[31,12,31,16],[10,12,20,16],[21,12,24,16],[36,12,41,16]]}
[]
[]
[]
[]
[]
[null,null,null,"Langzeitarbeitslosigkeitsrisiko"]
[null,null,null,{"$f":"Steuer!A2","v":"2022 / 2023"}]
[null,null,null,{"$f":"Steuer!C5&\", \"&Steuer!C15","v":"Deutschland, Süddeutschland"}]
[null,null,null,{"$f":"Steuer!J23","v":"Ausgewählte Merkmale: Für die Merkmale Rechtskreis im Zugang, Geschlecht, Alter, Staatsangehörigkeit und Berufsausbildung wurde keine Auswahl getroffen."}]
[null,null,null,{"$f":"CONCATENATE(\"Vergleich über Risikoklassen von \",Steuer!C5,\", \",Steuer!C15,\" und allen Regionen\")","v":"Vergleich über Risikoklassen von Deutschland, Süddeutschland und allen Regionen"}]
[null,null,null,null,null,null,null,null,null,null,null,null,"Die Risikoklassen werden über alle Regionen und für die jeweils ausgewählten Großregionen gebildet. Dazu werden die Merkmalsgruppen über alle oder in der ausgewählten Großregion nach der Höhe des Übertrittsrisikos aufsteigend sortiert und gleichmäßig auf fünf Risikogruppen verteilt. Die Zuordnung zur Risikogruppe kann sich unterscheiden, weil die Risiken in den Regionen unterschiedlich ausfallen: Das Risiko kann z.B. in der ausgewählten Großregion hoch (niedrig), über alle Regionen gesehen aber niedrig (hoch) sein. "]
[]
[]
[]
[]
[]
[]
[]
[]
[]
[]
[null,null,null,null,null,null,null,null,null,null,null,null,"Für die Auswahl \"Deutschland\" werden die Durch-schnittswerte für Deutschland und entsprechend die Risikoklassen für die Durchschnittswerte der Merk-malsgruppen angegeben."]
[]
[]
[]
[]
[null,null,null,null,null,null,null,null,null,null,null,null,{"$f":"Steuer!C5","v":"Deutschland"}]
[null,null,null,null,null,null,null,null,null,null,null,null,"Risiko",null,null,{"$f":"IFERROR((TEXT(Berechnung!Q21,\"#0,0\")&IF(Berechnung!Q21=\"k.A.\",\"\",\"%\")),\"k.A.\")","v":"14,3%"},{"$f":"IF(ISERROR(Berechnung!Q22),\"\",Berechnung!Q30)","v":"mittel"}]
[null,null,null,null,null,null,null,null,null,null,null,null,"Zugänge (ohne Unterbrecher)",null,null,{"$f":"TEXT(Steuer!O4,\"#.###\")","v":"4.594.317"}]
[null,null,null,null,null,null,null,null,null,null,null,null,"Übertritte",null,null,{"$f":"TEXT(Steuer!P4,\"#.###\")","v":"657.480"}]
[]
[null,null,null,null,null,null,null,null,null,null,null,null,{"$f":"Steuer!C15","v":"Süddeutschland"}]
[null,null,null,null,null,null,null,null,null,null,null,null,"Risiko",null,null,{"$f":"IFERROR((TEXT(Berechnung!S21,\"#0,0\")&IF(Berechnung!S21=\"k.A.\",\"\",\"%\")),\"k.A.\")","v":"10,8%"},{"$f":"IF(ISERROR(Berechnung!S22),\"\",Berechnung!S30)","v":"mittel"}]
[null,null,null,null,null,null,null,null,null,null,null,null,"Zugänge (ohne Unterbrecher)",null,null,{"$f":"TEXT(Steuer!O5,\"#.###\")","v":"1.102.660"}]
[null,null,null,null,null,null,null,null,null,null,null,null,"Übertritte",null,null,{"$f":"TEXT(Steuer!P5,\"#.###\")","v":"119.237"}]
[]
[null,null,null,null,null,null,null,null,null,null,null,null,{"$f":"IF(OR(P29=\"*\",P30=\"*\",P34=\"*\",P35=\"*\"),Steuer!J16,\"\")","v":""}]
[]
[]
[]
[]
[]
[null,null,null,"n ist die Anzahl der Merkmale, die für die Berechnung der Risikoklassen verwendet werden konnten"]
[null,null,null,null,null,null,null,null,null,null,null,null,null,null,null,null,null,"© Statistik der Bundesagentur für Arbeit  "]

{"sheet":"Steuer","index":6,"n_rows":30,"n_cols":16,"rows_kept":30,"cut":false,"hidden":true,"merged":[[0,11,0,15]]}
["Übersicht",null,1,null,2,3,4,5,6,null,null,"Kurzübersicht"]
["2022 / 2023",null,null,null,null,null,null,null,null,"ID","Zeile in Roh","Risk","RiskRech","RiskKlasse","FallZug","FallUeber"]
["AuswahlRegion1",{"$f":"INDEX(CB_Reg_kurz,MATCH($C$5,CB_Reg1,0),1)","v":"BA"},null,null,null,null,null,null,null,"alle Regionen",null,null,null,{"$f":"Berechnung!O30","v":"mittel"}]
["AuswahlRegion2",{"$f":"INDEX(CB_Reg_kurz,MATCH($C$15,CB_Reg2,0),1)","v":"SD"},null,null,null,null,null,null,null,{"$f":"$B$3&D5&F5&G5&H5&I5","v":"BAInsgesamtInsgesamtInsgesamtInsgesamtInsgesamt"},{"$f":"MATCH(J4,Roh!A:A,0)","v":3},{"$f":"INDIRECT(ADDRESS($K4,$L$6,1,1,\"Roh\"))","v":"14,3"},{"$f":"INDIRECT(ADDRESS($K4,$M$6,1,1,\"Roh\"))","v":14.310723443767595},{"$f":"Berechnung!Q30","v":"mittel"},{"$f":"INDIRECT(ADDRESS($K4,$O$6,1,1,\"Roh\"))","v":4594317},{"$f":"INDIRECT(ADDRESS($K4,$P$6,1,1,\"Roh\"))","v":657480}]
["ID",null,"Deutschland",{"$f":"INDEX(CB_RK_kurz,MATCH($E$5,CB_RK,0),1)","v":"Insgesamt"},"Insgesamt","Insgesamt","Insgesamt","Insgesamt","Insgesamt",{"$f":"B4&D5&F5&G5&H5&I5","v":"SDInsgesamtInsgesamtInsgesamtInsgesamtInsgesamt"},{"$f":"MATCH(J5,Roh!A:A,0)","v":651},{"$f":"INDIRECT(ADDRESS($K5,$L$6,1,1,\"Roh\"))","v":"10,8"},{"$f":"INDIRECT(ADDRESS($K5,$M$6,1,1,\"Roh\"))","v":10.813578074837212},{"$f":"Berechnung!S30","v":"mittel"},{"$f":"INDIRECT(ADDRESS($K5,$O$6,1,1,\"Roh\"))","v":1102660},{"$f":"INDIRECT(ADDRESS($K5,$P$6,1,1,\"Roh\"))","v":119237}]
["def. Name","CB_Regkurz","CB_Reg_1","CB_Rkkurz","CB_RK","CB_Geschl","CB_Alter","CB_Staat","CB_BAB","Spalten in Roh",null,4,5,null,2,3]
[null,"BA","Deutschland","Insgesamt","Insgesamt","Insgesamt","Insgesamt","Insgesamt","Insgesamt","MaximalWert",null,null,{"$f":"Berechnung!B3","v":33.400491598501027}]
[null,"SD","Süddeutschland","II","Rechtskreis SGB II","Männlich","15 bis unter 25 Jahre","Deutsche","Keine Berufsausbildung"]
[null,"SWD","Südwestdeutschland","III","Rechtskreis SGB III","Weiblich","25 bis unter 35 Jahre","Ausländer","Betriebliche/schulische Ausbildung","Text Risikoeinordnung"]
[null,"NRW","Nordrhein-Westfalen",null,null,null,"35 bis unter 45 Jahre",null,"Akademische Ausbildung",{"$f":"IFERROR(CONCATENATE(\"Das Risiko für die ausgewählte Merkmalsgruppe in der Region \",C5, \" liegt bei \",TEXT(Berechnung!Q21,\"#0,0\")&IF(Berechnung!Q21=\"k.A.\",\"\",\"%\"), \". Bezogen auf alle Regionen und alle Merkmalsgruppen wird das Risiko in die Risikoklasse \"\"\", N3, \"\"\" eingeordnet.\"),$J$14)","v":"Das Risiko für die ausgewählte Merkmalsgruppe in der Region Deutschland liegt bei 14,3%. Bezogen auf alle Regionen und alle Merkmalsgruppen wird das Risiko in die Risikoklasse \"mittel\" eingeordnet."}]
[null,"ND","Norddeutschland",null,null,null,"45 bis unter 55 Jahre",null,null,{"$f":"IFERROR(CONCATENATE(\"Das Risiko für die ausgewählte Merkmalsgruppe in der Region \",C5,\" liegt bei \",TEXT(Berechnung!Q21,\"#0,0\")&IF(Berechnung!Q21=\"k.A.\",\"\",\"%\"),\". Bezogen auf diese Region wird das Risiko in die Risikoklasse \"\"\", N4, \"\"\" eingeordnet.\"),$J$14)","v":"Das Risiko für die ausgewählte Merkmalsgruppe in der Region Deutschland liegt bei 14,3%. Bezogen auf diese Region wird das Risiko in die Risikoklasse \"mittel\" eingeordnet."}]
[null,"OD","Ostdeutschland",null,null,null,"55 und älter",null,null,{"$f":"IFERROR(CONCATENATE(\"Das Risiko für die ausgewählte Merkmalsgruppe in der Region \",C15,\" liegt bei \",TEXT(Berechnung!S21,\"#0,0\")&IF(Berechnung!S21=\"k.A.\",\"\",\"%\"),\". Bezogen auf diese Region wird das Risiko in die Risikoklasse \"\"\",N5,\"\"\" eingeordnet.\"),$J$14)","v":"Das Risiko für die ausgewählte Merkmalsgruppe in der Region Süddeutschland liegt bei 10,8%. Bezogen auf diese Region wird das Risiko in die Risikoklasse \"mittel\" eingeordnet."}]
[]
[null,null,null,null,null,null,null,null,null,"Für die Region kann auf Grund des Datenschutzes oder einer zu geringen Fallzahl der Zugänge kein Risiko ermittelt werden."]
[null,null,"Süddeutschland"]
[null,null,"CB_Reg_2",null,null,null,null,null,null,"*) Aus Datenschutzgründen und Gründen der statistischen Geheimhaltung werden Zahlenwerte von 1 oder 2 und Daten, aus denen rechnerisch auf einen solchen Zahlenwert geschlossen werden kann, anonymisiert."]
[null,null,"Deutschland"]
[null,null,"Süddeutschland",null,null,null,null,null,null,"Beschriftung Grafiken X-Achse"]
[null,null,"Südwestdeutschland",null,null,null,null,null,null,{"$f":"\"Risikoklassen\"&CHAR(10)&C5","v":"Risikoklassen\nDeutschland"}]
[null,null,"Nordrhein-Westfalen",null,null,null,null,null,null,{"$f":"\"Risikoklassen\"&CHAR(10)&C15","v":"Risikoklassen\nSüddeutschland"}]
[null,null,"Norddeutschland"]
[null,null,"Ostdeutschland",null,null,null,null,null,null,"Text Auswahl"]
[null,null,null,null,null,null,null,null,"Anzeige des Textes",{"$f":"\"Ausgewählte Merkmale: \"&J24","v":"Ausgewählte Merkmale: Für die Merkmale Rechtskreis im Zugang, Geschlecht, Alter, Staatsangehörigkeit und Berufsausbildung wurde keine Auswahl getroffen."}]
[null,null,null,null,null,null,null,null,"Auswahl des Textes",{"$f":"IF(COUNTIF(E5:I5,\"Insgesamt\")=5,\"Für die Merkmale Rechtskreis im Zugang, Geschlecht, Alter, Staatsangehörigkeit und Berufsausbildung wurde keine Auswahl getroffen.\",J25)","v":"Für die Merkmale Rechtskreis im Zugang, Geschlecht, Alter, Staatsangehörigkeit und Berufsausbildung wurde keine Auswahl getroffen."}]
[null,null,null,null,null,null,null,null,"Abschneiden des Kommas",{"$f":"MID(J26&J27&J28&J29&J30,1,LEN(J26&J27&J28&J29&J30)-2)","v":{"$error":"#VALUE!"}}]
[null,null,null,null,null,null,null,null,"CB_Geschl",{"$f":"IF(F5=\"Insgesamt\",\"\",F5&\", \")","v":""}]
[null,null,null,null,null,null,null,null,"CB_Alter",{"$f":"IF(G5=\"Insgesamt\",\"\",G5&\", \")","v":""}]
[null,null,null,null,null,null,null,null,"CB_Staat",{"$f":"IF(H5=\"Insgesamt\",\"\",H5&\", \")","v":""}]
[null,null,null,null,null,null,null,null,"CB_BAB",{"$f":"IF(I5=\"Insgesamt\",\"\",I5&\", \")","v":""}]
[null,null,null,null,null,null,null,null,"CB_RK",{"$f":"IF(E5=\"Insgesamt\",\"\",E5&\", \")","v":""}]

{"sheet":"Roh","index":7,"n_rows":3890,"n_cols":5,"rows_kept":3890,"cut":false,"hidden":true,"merged":[]}
[]
["ID\nRegRKGeschlAlterStaatBAB","Zug<20_DS","Ueb_DS","RiskAusg","RiskRech"]
["BAInsgesamtInsgesamtInsgesamtInsgesamtInsgesamt",4594317,657480,"14,3",14.310723443767595]
["BAInsgesamtInsgesamtInsgesamtInsgesamtKeine Berufsausbildung",2457103,386555,"15,7",15.73214472490571]
["BAInsgesamtInsgesamtInsgesamtInsgesamtBetriebliche/schulische Ausbildung",1609334,217646,"13,5",13.52397948468124]
["BAInsgesamtInsgesamtInsgesamtInsgesamtAkademische Ausbildung",527880,53279,"10,1",10.093013563688718]
["BAInsgesamtInsgesamtInsgesamtDeutscheInsgesamt",2828920,403959,"14,3",14.279619077245027]
["BAInsgesamtInsgesamtInsgesamtDeutscheKeine Berufsausbildung",1096112,181740,"16,6",16.580422438582918]
["BAInsgesamtInsgesamtInsgesamtDeutscheBetriebliche/schulische Ausbildung",1390222,189331,"13,6",13.618760169239158]
["BAInsgesamtInsgesamtInsgesamtDeutscheAkademische Ausbildung",342586,32888,"9,6",9.5999252742377106]
["BAInsgesamtInsgesamtInsgesamtAusländerInsgesamt",1765376,253520,"14,4",14.360680104408353]
["BAInsgesamtInsgesamtInsgesamtAusländerKeine Berufsausbildung",1360973,204814,"15,0",15.049086205236989]
["BAInsgesamtInsgesamtInsgesamtAusländerBetriebliche/schulische Ausbildung",219110,28315,"12,9",12.922732873898953]
["BAInsgesamtInsgesamtInsgesamtAusländerAkademische Ausbildung",185293,20391,"11,0",11.004733044421537]
["BAInsgesamtInsgesamt15 bis unter 25 JahreInsgesamtInsgesamt",742861,51698,"7,0",6.9593100189672086]
["BAInsgesamtInsgesamt15 bis unter 25 JahreInsgesamtKeine Berufsausbildung",529702,44741,"8,4",8.4464472476977619]
["BAInsgesamtInsgesamt15 bis unter 25 JahreInsgesamtBetriebliche/schulische Ausbildung",198396,6416,"3,2",3.2339361680679044]
["BAInsgesamtInsgesamt15 bis unter 25 JahreInsgesamtAkademische Ausbildung",14763,541,"3,7",3.6645668224615595]
["BAInsgesamtInsgesamt15 bis unter 25 JahreDeutscheInsgesamt",481441,32139,"6,7",6.6755843395140833]
["BAInsgesamtInsgesamt15 bis unter 25 JahreDeutscheKeine Berufsausbildung",298126,26640,"8,9",8.9358190832064288]
["BAInsgesamtInsgesamt15 bis unter 25 JahreDeutscheBetriebliche/schulische Ausbildung",174283,5341,"3,1",3.064555923411922]
["BAInsgesamtInsgesamt15 bis unter 25 JahreDeutscheAkademische Ausbildung",9032,158,"1,7",1.7493356953055803]
["BAInsgesamtInsgesamt15 bis unter 25 JahreAusländerInsgesamt",261416,19559,"7,5",7.4819444869480058]
["BAInsgesamtInsgesamt15 bis unter 25 JahreAusländerKeine Berufsausbildung",231573,18101,"7,8",7.8165416520924289]
["BAInsgesamtInsgesamt15 bis unter 25 JahreAusländerBetriebliche/schulische Ausbildung",24112,1075,"4,5",4.4583609820836099]
["BAInsgesamtInsgesamt15 bis unter 25 JahreAusländerAkademische Ausbildung",5731,383,"6,7",6.6829523643343229]
["BAInsgesamtInsgesamt25 bis unter 35 JahreInsgesamtInsgesamt",1213231,148587,"12,2",12.247214256806824]
["BAInsgesamtInsgesamt25 bis unter 35 JahreInsgesamtKeine Berufsausbildung",637314,102215,"16,0",16.038404930693503]
["BAInsgesamtInsgesamt25 bis unter 35 JahreInsgesamtBetriebliche/schulische Ausbildung",377328,34972,"9,3",9.2683288809735824]
["BAInsgesamtInsgesamt25 bis unter 35 JahreInsgesamtAkademische Ausbildung",198589,11400,"5,7",5.7404992220112891]
["BAInsgesamtInsgesamt25 bis unter 35 JahreDeutscheInsgesamt",707658,82080,"11,6",11.598823160340164]
["BAInsgesamtInsgesamt25 bis unter 35 JahreDeutscheKeine Berufsausbildung",263151,48096,"18,3",18.276958856322036]
["BAInsgesamtInsgesamt25 bis unter 35 JahreDeutscheBetriebliche/schulische Ausbildung",314944,28472,"9,0",9.040337329811015]
["BAInsgesamtInsgesamt25 bis unter 35 JahreDeutscheAkademische Ausbildung",129563,5512,"4,3",4.2543009964264487]
["BAInsgesamtInsgesamt25 bis unter 35 JahreAusländerInsgesamt",505572,66507,"13,2",13.154802876741591]
["BAInsgesamtInsgesamt25 bis unter 35 JahreAusländerKeine Berufsausbildung",374162,54119,"14,5",14.464055676418235]
["BAInsgesamtInsgesamt25 bis unter 35 JahreAusländerBetriebliche/schulische Ausbildung",62384,6500,"10,4",10.41933829186971]
["BAInsgesamtInsgesamt25 bis unter 35 JahreAusländerAkademische Ausbildung",69026,5888,"8,5",8.530119085561962]
["BAInsgesamtInsgesamt35 bis unter 45 JahreInsgesamtInsgesamt",1072050,156423,"14,6",14.59101721001819]
["BAInsgesamtInsgesamt35 bis unter 45 JahreInsgesamtKeine Berufsausbildung",563959,98268,"17,4",17.424670942391202]
["BAInsgesamtInsgesamt35 bis unter 45 JahreInsgesamtBetriebliche/schulische Ausbildung",347141,43554,"12,5",12.546486874209615]
["BAInsgesamtInsgesamt35 bis unter 45 JahreInsgesamtAkademische Ausbildung",160950,14601,"9,1",9.0717614165890019]
["BAInsgesamtInsgesamt35 bis unter 45 JahreDeutscheInsgesamt",580672,81208,"14,0",13.985175796318746]
["BAInsgesamtInsgesamt35 bis unter 45 JahreDeutscheKeine Berufsausbildung",201090,38950,"19,4",19.369436570689739]
["BAInsgesamtInsgesamt35 bis unter 45 JahreDeutscheBetriebliche/schulische Ausbildung",287966,35401,"12,3",12.293465200752866]
["BAInsgesamtInsgesamt35 bis unter 45 JahreDeutscheAkademische Ausbildung",91616,6857,"7,5",7.4845005239259521]
["BAInsgesamtInsgesamt35 bis unter 45 JahreAusländerInsgesamt",491372,75215,"15,3",15.307140007977663]
["BAInsgesamtInsgesamt35 bis unter 45 JahreAusländerKeine Berufsausbildung",362863,59318,"16,3",16.347216442569234]
["BAInsgesamtInsgesamt35 bis unter 45 JahreAusländerBetriebliche/schulische Ausbildung",59175,8153,"13,8",13.777777777777779]
["BAInsgesamtInsgesamt35 bis unter 45 JahreAusländerAkademische Ausbildung",69334,7744,"11,2",11.169123373813713]
["BAInsgesamtInsgesamt45 bis unter 55 JahreInsgesamtInsgesamt",815610,122923,"15,1",15.071296330353967]
["BAInsgesamtInsgesamt45 bis unter 55 JahreInsgesamtKeine Berufsausbildung",412111,71515,"17,4",17.353334417183717]
["BAInsgesamtInsgesamt45 bis unter 55 JahreInsgesamtBetriebliche/schulische Ausbildung",323165,42496,"13,1",13.14993888570854]
["BAInsgesamtInsgesamt45 bis unter 55 JahreInsgesamtAkademische Ausbildung",80334,8912,"11,1",11.093683869843405]
["BAInsgesamtInsgesamt45 bis unter 55 JahreDeutscheInsgesamt",488641,68598,"14,0",14.038527262345976]
["BAInsgesamtInsgesamt45 bis unter 55 JahreDeutscheKeine Berufsausbildung",162010,28023,"17,3",17.29708042713413]
["BAInsgesamtInsgesamt45 bis unter 55 JahreDeutscheBetriebliche/schulische Ausbildung",274802,35435,"12,9",12.894738757359844]
["BAInsgesamtInsgesamt45 bis unter 55 JahreDeutscheAkademische Ausbildung",51829,5140,"9,9",9.9172278068262933]
["BAInsgesamtInsgesamt45 bis unter 55 JahreAusländerInsgesamt",326960,54324,"16,6",16.614876437484707]
["BAInsgesamtInsgesamt45 bis unter 55 JahreAusländerKeine Berufsausbildung",250094,43491,"17,4",17.389861412109049]
["BAInsgesamtInsgesamt45 bis unter 55 JahreAusländerBetriebliche/schulische Ausbildung",48362,7061,"14,6",14.600306025391838]
["BAInsgesamtInsgesamt45 bis unter 55 JahreAusländerAkademische Ausbildung",28504,3772,"13,2",13.233230423800169]
["BAInsgesamtInsgesamt55 und älterInsgesamtInsgesamt",750565,177849,"23,7",23.695349503374125]
["BAInsgesamtInsgesamt55 und älterInsgesamtKeine Berufsausbildung",314017,69816,"22,2",22.233191196654957]
["BAInsgesamtInsgesamt55 und älterInsgesamtBetriebliche/schulische Ausbildung",363304,90208,"24,8",24.829894523594565]
["BAInsgesamtInsgesamt55 und älterInsgesamtAkademische Ausbildung",73244,17825,"24,3",24.336464420293812]
["BAInsgesamtInsgesamt55 und älterDeutscheInsgesamt",570508,139934,"24,5",24.527964550891486]
["BAInsgesamtInsgesamt55 und älterDeutscheKeine Berufsausbildung",171735,40031,"23,3",23.309750487669955]
["BAInsgesamtInsgesamt55 und älterDeutscheBetriebliche/schulische Ausbildung",338227,84682,"25,0",25.037031342855538]
["BAInsgesamtInsgesamt55 und älterDeutscheAkademische Ausbildung",60546,15221,"25,1",25.139563307237474]
["BAInsgesamtInsgesamt55 und älterAusländerInsgesamt",180056,37915,"21,1",21.057337717154663]
["BAInsgesamtInsgesamt55 und älterAusländerKeine Berufsausbildung",142281,29785,"20,9",20.933926525678061]
["BAInsgesamtInsgesamt55 und älterAusländerBetriebliche/schulische Ausbildung",25077,5526,"22,0",22.036128723531522]
["BAInsgesamtInsgesamt55 und älterAusländerAkademische Ausbildung",12698,2604,"20,5",20.507166482910694]
["BAInsgesamtMännlichInsgesamtInsgesamtInsgesamt",2411439,349282,"14,5",14.48438048816495]
["BAInsgesamtMännlichInsgesamtInsgesamtKeine Berufsausbildung",1293920,199319,"15,4",15.40427538023989]
["BAInsgesamtMännlichInsgesamtInsgesamtBetriebliche/schulische Ausbildung",884123,123161,"13,9",13.930301553064449]
["BAInsgesamtMännlichInsgesamtInsgesamtAkademische Ausbildung",233396,26802,"11,5",11.483487291984439]
["BAInsgesamtMännlichInsgesamtDeutscheInsgesamt",1541869,230156,"14,9",14.92707875960928]
["BAInsgesamtMännlichInsgesamtDeutscheKeine Berufsausbildung",614460,101844,"16,6",16.574553266282592]
["BAInsgesamtMännlichInsgesamtDeutscheBetriebliche/schulische Ausbildung",766474,109382,"14,3",14.270803706322718]
["BAInsgesamtMännlichInsgesamtDeutscheAkademische Ausbildung",160935,18930,"11,8",11.762512815733061]
["BAInsgesamtMännlichInsgesamtAusländerInsgesamt",869558,119126,"13,7",13.699603706710766]
["BAInsgesamtMännlichInsgesamtAusländerKeine Berufsausbildung",679450,97475,"14,3",14.346162337184488]
["BAInsgesamtMännlichInsgesamtAusländerBetriebliche/schulische Ausbildung",117647,13779,"11,7",11.712155856077928]
["BAInsgesamtMännlichInsgesamtAusländerAkademische Ausbildung",72461,7872,"10,9",10.863774996204855]
["BAInsgesamtMännlich15 bis unter 25 JahreInsgesamtInsgesamt",423710,29986,"7,1",7.0770102192537347]
["BAInsgesamtMännlich15 bis unter 25 JahreInsgesamtKeine Berufsausbildung",305726,26149,"8,6",8.5530834799788042]
["BAInsgesamtMännlich15 bis unter 25 JahreInsgesamtBetriebliche/schulische Ausbildung",113166,3666,"3,2",3.2394888924235192]
["BAInsgesamtMännlich15 bis unter 25 JahreInsgesamtAkademische Ausbildung",4818,171,"3,5",3.5491905354919058]
["BAInsgesamtMännlich15 bis unter 25 JahreDeutscheInsgesamt",275756,18534,"6,7",6.7211592857453688]
["BAInsgesamtMännlich15 bis unter 25 JahreDeutscheKeine Berufsausbildung",172691,15357,"8,9",8.8927622169076557]
["BAInsgesamtMännlich15 bis unter 25 JahreDeutscheBetriebliche/schulische Ausbildung",99741,3106,"3,1",3.1140654294623071]
["BAInsgesamtMännlich15 bis unter 25 JahreDeutscheAkademische Ausbildung",3324,71,"2,1",2.1359807460890492]
["BAInsgesamtMännlich15 bis unter 25 JahreAusländerInsgesamt",147951,11452,"7,7",7.7404005380159653]
["BAInsgesamtMännlich15 bis unter 25 JahreAusländerKeine Berufsausbildung",133033,10792,"8,1",8.1122728946953]
["BAInsgesamtMännlich15 bis unter 25 JahreAusländerBetriebliche/schulische Ausbildung",13424,560,"4,2",4.171632896305125]
["BAInsgesamtMännlich15 bis unter 25 JahreAusländerAkademische Ausbildung",1494,100,"6,7",6.6934404283801872]
["BAInsgesamtMännlich25 bis unter 35 JahreInsgesamtInsgesamt",653908,78790,"12,0",12.049095591428765]
["BAInsgesamtMännlich25 bis unter 35 JahreInsgesamtKeine Berufsausbildung",357795,54766,"15,3",15.306530275716543]
["BAInsgesamtMännlich25 bis unter 35 JahreInsgesamtBetriebliche/schulische Ausbildung",213004,19062,"8,9",8.9491277159114375]
["BAInsgesamtMännlich25 bis unter 35 JahreInsgesamtAkademische Ausbildung",83109,4962,"6,0",5.9704725120023099]
["BAInsgesamtMännlich25 bis unter 35 JahreDeutscheInsgesamt",387413,46009,"11,9",11.87595666639994]
["BAInsgesamtMännlich25 bis unter 35 JahreDeutscheKeine Berufsausbildung",154539,27350,"17,7",17.697797966856264]
["BAInsgesamtMännlich25 bis unter 35 JahreDeutscheBetriebliche/schulische Ausbildung",177621,15913,"9,0",8.9589631856593535]
["BAInsgesamtMännlich25 bis unter 35 JahreDeutscheAkademische Ausbildung",55253,2746,"5,0",4.9698658896349519]
["BAInsgesamtMännlich25 bis unter 35 JahreAusländerInsgesamt",266494,32781,"12,3",12.300839793766464]
["BAInsgesamtMännlich25 bis unter 35 JahreAusländerKeine Berufsausbildung",203255,27416,"13,5",13.488475068264002]
["BAInsgesamtMännlich25 bis unter 35 JahreAusländerBetriebliche/schulische Ausbildung",35383,3149,"8,9",8.8997541192097902]
["BAInsgesamtMännlich25 bis unter 35 JahreAusländerAkademische Ausbildung",27856,2216,"8,0",7.9551981619758765]
["BAInsgesamtMännlich35 bis unter 45 JahreInsgesamtInsgesamt",531316,78099,"14,7",14.699162080569755]
["BAInsgesamtMännlich35 bis unter 45 JahreInsgesamtKeine Berufsausbildung",277507,47987,"17,3",17.292176413567947]
["BAInsgesamtMännlich35 bis unter 45 JahreInsgesamtBetriebliche/schulische Ausbildung",186357,23983,"12,9",12.869385104933004]
["BAInsgesamtMännlich35 bis unter 45 JahreInsgesamtAkademische Ausbildung",67452,6129,"9,1",9.0864614837217577]
["BAInsgesamtMännlich35 bis unter 45 JahreDeutscheInsgesamt",310689,45664,"14,7",14.697655855212124]
["BAInsgesamtMännlich35 bis unter 45 JahreDeutscheKeine Berufsausbildung",113372,22170,"19,6",19.555092968281411]
["BAInsgesamtMännlich35 bis unter 45 JahreDeutscheBetriebliche/schulische Ausbildung",156190,20195,"12,9",12.929765029771431]
["BAInsgesamtMännlich35 bis unter 45 JahreDeutscheAkademische Ausbildung",41127,3299,"8,0",8.0214943954093414]
["BAInsgesamtMännlich35 bis unter 45 JahreAusländerInsgesamt",220623,32435,"14,7",14.701549702433564]
["BAInsgesamtMännlich35 bis unter 45 JahreAusländerKeine Berufsausbildung",164131,25817,"15,7",15.729508746062596]
["BAInsgesamtMännlich35 bis unter 45 JahreAusländerBetriebliche/schulische Ausbildung",30167,3788,"12,6",12.556767328537807]
["BAInsgesamtMännlich35 bis unter 45 JahreAusländerAkademische Ausbildung",26325,2830,"10,8",10.750237416904083]
["BAInsgesamtMännlich45 bis unter 55 JahreInsgesamtInsgesamt",406201,63969,"15,7",15.748114849544931]
["BAInsgesamtMännlich45 bis unter 55 JahreInsgesamtKeine Berufsausbildung",197904,35050,"17,7",17.710607163068961]
["BAInsgesamtMännlich45 bis unter 55 JahreInsgesamtBetriebliche/schulische Ausbildung",171652,24480,"14,3",14.261412625544706]
["BAInsgesamtMännlich45 bis unter 55 JahreInsgesamtAkademische Ausbildung",36645,4439,"12,1",12.11352162641561]
["BAInsgesamtMännlich45 bis unter 55 JahreDeutscheInsgesamt",257495,39581,"15,4",15.371560612827434]
["BAInsgesamtMännlich45 bis unter 55 JahreDeutscheKeine Berufsausbildung",84798,15648,"18,5",18.453265407203002]
["BAInsgesamtMännlich45 bis unter 55 JahreDeutscheBetriebliche/schulische Ausbildung",147022,21027,"14,3",14.301941206078004]
["BAInsgesamtMännlich45 bis unter 55 JahreDeutscheAkademische Ausbildung",25675,2906,"11,3",11.318403115871471]
["BAInsgesamtMännlich45 bis unter 55 JahreAusländerInsgesamt",148703,24388,"16,4",16.400476116823466]
["BAInsgesamtMännlich45 bis unter 55 JahreAusländerKeine Berufsausbildung",113104,19402,"17,2",17.154123638421275]
["BAInsgesamtMännlich45 bis unter 55 JahreAusländerBetriebliche/schulische Ausbildung",24629,3453,"14,0",14.020057655609241]
["BAInsgesamtMännlich45 bis unter 55 JahreAusländerAkademische Ausbildung",10970,1533,"14,0",13.974475843208751]
["BAInsgesamtMännlich55 und älterInsgesamtInsgesamt",396304,98438,"24,8",24.839012475271506]
["BAInsgesamtMännlich55 und älterInsgesamtKeine Berufsausbildung",154988,35367,"22,8",22.819186001496892]
["BAInsgesamtMännlich55 und älterInsgesamtBetriebliche/schulische Ausbildung",199944,51970,"26,0",25.992277837794582]
["BAInsgesamtMännlich55 und älterInsgesamtAkademische Ausbildung",41372,11101,"26,8",26.832157014405876]
["BAInsgesamtMännlich55 und älterDeutscheInsgesamt",310516,80368,"25,9",25.882080150459235]
["BAInsgesamtMännlich55 und älterDeutscheKeine Berufsausbildung",89060,21319,"23,9",23.937794745115653]
["BAInsgesamtMännlich55 und älterDeutscheBetriebliche/schulische Ausbildung",185900,49141,"26,4",26.434104357181283]
["BAInsgesamtMännlich55 und älterDeutscheAkademische Ausbildung",35556,9908,"27,9",27.865901676229051]
["BAInsgesamtMännlich55 und älterAusländerInsgesamt",85787,18070,"21,1",21.06379754508259]
["BAInsgesamtMännlich55 und älterAusländerKeine Berufsausbildung",65927,14048,"21,3",21.308416885342879]
["BAInsgesamtMännlich55 und älterAusländerBetriebliche/schulische Ausbildung",14044,2829,"20,1",20.143833665622328]
["BAInsgesamtMännlich55 und älterAusländerAkademische Ausbildung",5816,1193,"20,5",20.51237964236589]
["BAInsgesamtWeiblichInsgesamtInsgesamtInsgesamt",2182825,308198,"14,1",14.119226232061663]
["BAInsgesamtWeiblichInsgesamtInsgesamtKeine Berufsausbildung",1163155,187236,"16,1",16.097252730719465]
["BAInsgesamtWeiblichInsgesamtInsgesamtBetriebliche/schulische Ausbildung",725205,94485,"13,0",13.028729807433759]
["BAInsgesamtWeiblichInsgesamtInsgesamtAkademische Ausbildung",294465,26477,"9,0",8.9915609664985663]
["BAInsgesamtWeiblichInsgesamtDeutscheInsgesamt",1287020,173803,"13,5",13.504296747525292]
["BAInsgesamtWeiblichInsgesamtDeutscheKeine Berufsausbildung",481635,79896,"16,6",16.588495437416302]
["BAInsgesamtWeiblichInsgesamtDeutscheBetriebliche/schulische Ausbildung",623744,79949,"12,8",12.817598245434025]
["BAInsgesamtWeiblichInsgesamtDeutscheAkademische Ausbildung",181641,13958,"7,7",7.6843884365314006]
["BAInsgesamtWeiblichInsgesamtAusländerInsgesamt",895796,134394,"15,0",15.00274616095629]
["BAInsgesamtWeiblichInsgesamtAusländerKeine Berufsausbildung",681512,107339,"15,8",15.750126190001057]
["BAInsgesamtWeiblichInsgesamtAusländerBetriebliche/schulische Ausbildung",101461,14536,"14,3",14.326687101447847]
["BAInsgesamtWeiblichInsgesamtAusländerAkademische Ausbildung",112823,12519,"11,1",11.096141744147914]
["BAInsgesamtWeiblich15 bis unter 25 JahreInsgesamtInsgesamt",319136,21712,"6,8",6.8033690965607141]
["BAInsgesamtWeiblich15 bis unter 25 JahreInsgesamtKeine Berufsausbildung",223967,18592,"8,3",8.3012229480235931]
["BAInsgesamtWeiblich15 bis unter 25 JahreInsgesamtBetriebliche/schulische Ausbildung",85227,2750,"3,2",3.2266769920330409]
["BAInsgesamtWeiblich15 bis unter 25 JahreInsgesamtAkademische Ausbildung",9942,370,"3,7",3.7215851941259301]
["BAInsgesamtWeiblich15 bis unter 25 JahreDeutscheInsgesamt",205674,13605,"6,6",6.6148370722599843]
["BAInsgesamtWeiblich15 bis unter 25 JahreDeutscheKeine Berufsausbildung",125428,11283,"9,0",8.9955990687884686]
["BAInsgesamtWeiblich15 bis unter 25 JahreDeutscheBetriebliche/schulische Ausbildung",74540,2235,"3,0",2.9983901261067882]
["BAInsgesamtWeiblich15 bis unter 25 JahreDeutscheAkademische Ausbildung",5706,87,"1,5",1.5247108307045216]
["BAInsgesamtWeiblich15 bis unter 25 JahreAusländerInsgesamt",113461,8107,"7,1",7.1451864517323136]
["BAInsgesamtWeiblich15 bis unter 25 JahreAusländerKeine Berufsausbildung",98538,7309,"7,4",7.4174430169071828]
["BAInsgesamtWeiblich15 bis unter 25 JahreAusländerBetriebliche/schulische Ausbildung",10687,515,"4,8",4.81893889772621]
["BAInsgesamtWeiblich15 bis unter 25 JahreAusländerAkademische Ausbildung",4236,283,"6,7",6.6808309726156754]
["BAInsgesamtWeiblich25 bis unter 35 JahreInsgesamtInsgesamt",559306,69797,"12,5",12.479215313263223]
["BAInsgesamtWeiblich25 bis unter 35 JahreInsgesamtKeine Berufsausbildung",279512,47449,"17,0",16.97565757463007]
["BAInsgesamtWeiblich25 bis unter 35 JahreInsgesamtBetriebliche/schulische Ausbildung",164323,15910,"9,7",9.6821503989094637]
["BAInsgesamtWeiblich25 bis unter 35 JahreInsgesamtAkademische Ausbildung",115471,6438,"5,6",5.5754258645027752]
["BAInsgesamtWeiblich25 bis unter 35 JahreDeutscheInsgesamt",320234,36071,"11,3",11.263950736024283]
["BAInsgesamtWeiblich25 bis unter 35 JahreDeutscheKeine Berufsausbildung",108609,20746,"19,1",19.101547753869387]
["BAInsgesamtWeiblich25 bis unter 35 JahreDeutscheBetriebliche/schulische Ausbildung",137322,12559,"9,1",9.1456576513595795]
["BAInsgesamtWeiblich25 bis unter 35 JahreDeutscheAkademische Ausbildung",74303,2766,"3,7",3.7225953191661172]
["BAInsgesamtWeiblich25 bis unter 35 JahreAusländerInsgesamt",239072,33726,"14,1",14.107047249364207]
["BAInsgesamtWeiblich25 bis unter 35 JahreAusländerKeine Berufsausbildung",170903,26703,"15,6",15.624652580703675]
["BAInsgesamtWeiblich25 bis unter 35 JahreAusländerBetriebliche/schulische Ausbildung",27001,3351,"12,4",12.410651457353431]
["BAInsgesamtWeiblich25 bis unter 35 JahreAusländerAkademische Ausbildung",41168,3672,"8,9",8.9195491643995339]
["BAInsgesamtWeiblich35 bis unter 45 JahreInsgesamtInsgesamt",540724,78324,"14,5",14.485023782928074]
["BAInsgesamtWeiblich35 bis unter 45 JahreInsgesamtKeine Berufsausbildung",286448,50281,"17,6",17.553273194436684]
["BAInsgesamtWeiblich35 bis unter 45 JahreInsgesamtBetriebliche/schulische Ausbildung",160783,19571,"12,2",12.172306773726078]
["BAInsgesamtWeiblich35 bis unter 45 JahreInsgesamtAkademische Ausbildung",93493,8472,"9,1",9.0616409784689758]
["BAInsgesamtWeiblich35 bis unter 45 JahreDeutscheInsgesamt",269982,35544,"13,2",13.165322132586619]
["BAInsgesamtWeiblich35 bis unter 45 JahreDeutscheKeine Berufsausbildung",87717,16780,"19,1",19.129701198171393]
["BAInsgesamtWeiblich35 bis unter 45 JahreDeutscheBetriebliche/schulische Ausbildung",131776,15206,"11,5",11.539278776104906]
["BAInsgesamtWeiblich35 bis unter 45 JahreDeutscheAkademische Ausbildung",50489,3558,"7,0",7.0470795618847673]
["BAInsgesamtWeiblich35 bis unter 45 JahreAusländerInsgesamt",270740,42780,"15,8",15.801137622811554]
["BAInsgesamtWeiblich35 bis unter 45 JahreAusländerKeine Berufsausbildung",198729,33501,"16,9",16.85763024017632]
["BAInsgesamtWeiblich35 bis unter 45 JahreAusländerBetriebliche/schulische Ausbildung",29007,4365,"15,0",15.048091839900712]
["BAInsgesamtWeiblich35 bis unter 45 JahreAusländerAkademische Ausbildung",43004,4914,"11,4",11.426844014510278]
["BAInsgesamtWeiblich45 bis unter 55 JahreInsgesamtInsgesamt",409404,58954,"14,4",14.399957010678937]
["BAInsgesamtWeiblich45 bis unter 55 JahreInsgesamtKeine Berufsausbildung",214204,36465,"17,0",17.023491624806258]
["BAInsgesamtWeiblich45 bis unter 55 JahreInsgesamtBetriebliche/schulische Ausbildung",151512,18016,"11,9",11.890807328792439]
["BAInsgesamtWeiblich45 bis unter 55 JahreInsgesamtAkademische Ausbildung",43688,4473,"10,2",10.238509430507232]
["BAInsgesamtWeiblich45 bis unter 55 JahreDeutscheInsgesamt",231142,29017,"12,6",12.553754834690364]
["BAInsgesamtWeiblich45 bis unter 55 JahreDeutscheKeine Berufsausbildung",77209,12375,"16,0",16.027924205727313]
["BAInsgesamtWeiblich45 bis unter 55 JahreDeutscheBetriebliche/schulische Ausbildung",127779,14408,"11,3",11.275718232260386]
["BAInsgesamtWeiblich45 bis unter 55 JahreDeutscheAkademische Ausbildung",26154,2234,"8,5",8.5417144605031741]
["BAInsgesamtWeiblich45 bis unter 55 JahreAusländerInsgesamt",178256,29936,"16,8",16.793824611794271]
["BAInsgesamtWeiblich45 bis unter 55 JahreAusländerKeine Berufsausbildung",136990,24089,"17,6",17.584495218629097]
["BAInsgesamtWeiblich45 bis unter 55 JahreAusländerBetriebliche/schulische Ausbildung",23733,3608,"15,2",15.202460708717819]
["BAInsgesamtWeiblich45 bis unter 55 JahreAusländerAkademische Ausbildung",17533,2239,"12,8",12.770204756744425]
["BAInsgesamtWeiblich55 und älterInsgesamtInsgesamt",354255,79411,"22,4",22.41633851321788]
["BAInsgesamtWeiblich55 und älterInsgesamtKeine Berufsausbildung",159024,34449,"21,7",21.662767884092968]
["BAInsgesamtWeiblich55 und älterInsgesamtBetriebliche/schulische Ausbildung",163360,38238,"23,4",23.407198824681686]
["BAInsgesamtWeiblich55 und älterInsgesamtAkademische Ausbildung",31871,6724,"21,1",21.097549496407392]
["BAInsgesamtWeiblich55 und älterDeutscheInsgesamt",259988,59566,"22,9",22.911057433420005]
["BAInsgesamtWeiblich55 und älterDeutscheKeine Berufsausbildung",82672,18712,"22,6",22.634023611379909]
["BAInsgesamtWeiblich55 und älterDeutscheBetriebliche/schulische Ausbildung",152327,35541,"23,3",23.332042251209568]
["BAInsgesamtWeiblich55 und älterDeutscheAkademische Ausbildung",24989,5313,"21,3",21.261354996198328]
["BAInsgesamtWeiblich55 und älterAusländerInsgesamt",94267,19845,"21,1",21.051905757051777]
["BAInsgesamtWeiblich55 und älterAusländerKeine Berufsausbildung",76352,15737,"20,6",20.61111693210394]
["BAInsgesamtWeiblich55 und älterAusländerBetriebliche/schulische Ausbildung",11033,2697,"24,4",24.44484727635276]
["BAInsgesamtWeiblich55 und älterAusländerAkademische Ausbildung",6882,1411,"20,5",20.502760825341472]
["BAIIIInsgesamtInsgesamtInsgesamtInsgesamt",2355262,233969,"9,9",9.9338842133062055]
["BAIIIInsgesamtInsgesamtInsgesamtKeine Berufsausbildung",805026,81223,"10,1",10.089487792940849]
["BAIIIInsgesamtInsgesamtInsgesamtBetriebliche/schulische Ausbildung",1160431,120910,"10,4",10.419404514357165]
["BAIIIInsgesamtInsgesamtInsgesamtAkademische Ausbildung",389805,31836,"8,2",8.1671605033285868]
["BAIIIInsgesamtInsgesamtDeutscheInsgesamt",1800338,188048,"10,4",10.445149744103608]
["BAIIIInsgesamtInsgesamtDeutscheKeine Berufsausbildung",470540,51208,"10,9",10.88281548858758]
["BAIIIInsgesamtInsgesamtDeutscheBetriebliche/schulische Ausbildung",1030483,111152,"10,8",10.786398222969229]
["BAIIIInsgesamtInsgesamtDeutscheAkademische Ausbildung",299315,25688,"8,6",8.5822628334697555]
["BAIIIInsgesamtInsgesamtAusländerInsgesamt",554924,45921,"8,3",8.2751872328462994]
["BAIIIInsgesamtInsgesamtAusländerKeine Berufsausbildung",334486,30015,"9,0",8.9734697416334317]
["BAIIIInsgesamtInsgesamtAusländerBetriebliche/schulische Ausbildung",129948,9758,"7,5",7.5091575091575091]
["BAIIIInsgesamtInsgesamtAusländerAkademische Ausbildung",90490,6148,"6,8",6.7941208973367226]
["BAIIIInsgesamt15 bis unter 25 JahreInsgesamtInsgesamt",373227,11677,"3,1",3.12865896625914]
["BAIIIInsgesamt15 bis unter 25 JahreInsgesamtKeine Berufsausbildung",184590,7151,"3,9",3.8739910070968095]
["BAIIIInsgesamt15 bis unter 25 JahreInsgesamtBetriebliche/schulische Ausbildung",179663,4424,"2,5",2.4623879151522572]
["BAIIIInsgesamt15 bis unter 25 JahreInsgesamtAkademische Ausbildung",8974,102,"1,1",1.1366168932471583]
["BAIIIInsgesamt15 bis unter 25 JahreDeutscheInsgesamt",305682,9177,"3,0",3.0021394782813511]
["BAIIIInsgesamt15 bis unter 25 JahreDeutscheKeine Berufsausbildung",136634,5222,"3,8",3.8218891344760455]
["BAIIIInsgesamt15 bis unter 25 JahreDeutscheBetriebliche/schulische Ausbildung",161411,3883,"2,4",2.40566008512431]
["BAIIIInsgesamt15 bis unter 25 JahreDeutscheAkademische Ausbildung",7637,72,"0,9",0.94277857797564502]
["BAIIIInsgesamt15 bis unter 25 JahreAusländerInsgesamt",67545,2500,"3,7",3.7012362128951071]
["BAIIIInsgesamt15 bis unter 25 JahreAusländerKeine Berufsausbildung",47956,1929,"4,0",4.0224372341312868]
["BAIIIInsgesamt15 bis unter 25 JahreAusländerBetriebliche/schulische Ausbildung",18252,541,"3,0",2.9640587332895025]
["BAIIIInsgesamt15 bis unter 25 JahreAusländerAkademische Ausbildung",1337,30,"2,2",2.2438294689603588]
["BAIIIInsgesamt25 bis unter 35 JahreInsgesamtInsgesamt",650065,39735,"6,1",6.1124656765092729]
["BAIIIInsgesamt25 bis unter 35 JahreInsgesamtKeine Berufsausbildung",210724,17508,"8,3",8.3084983200774474]
["BAIIIInsgesamt25 bis unter 35 JahreInsgesamtBetriebliche/schulische Ausbildung",286836,16271,"5,7",5.6725794530672582]
["BAIIIInsgesamt25 bis unter 35 JahreInsgesamtAkademische Ausbildung",152505,5956,"3,9",3.9054457230910464]
["BAIIIInsgesamt25 bis unter 35 JahreDeutscheInsgesamt",461709,26823,"5,8",5.8095033884979497]
["BAIIIInsgesamt25 bis unter 35 JahreDeutscheKeine Berufsausbildung",103740,9273,"8,9",8.9386928860613075]
["BAIIIInsgesamt25 bis unter 35 JahreDeutscheBetriebliche/schulische Ausbildung",245310,13760,"5,6",5.6092291386409032]
["BAIIIInsgesamt25 bis unter 35 JahreDeutscheAkademische Ausbildung",112659,3790,"3,4",3.3641342458214609]
["BAIIIInsgesamt25 bis unter 35 JahreAusländerInsgesamt",188356,12912,"6,9",6.8551041644545441]
["BAIIIInsgesamt25 bis unter 35 JahreAusländerKeine Berufsausbildung",106984,8235,"7,7",7.6974126972257526]
["BAIIIInsgesamt25 bis unter 35 JahreAusländerBetriebliche/schulische Ausbildung",41526,2511,"6,0",6.0468140442132636]
["BAIIIInsgesamt25 bis unter 35 JahreAusländerAkademische Ausbildung",39846,2166,"5,4",5.4359283240475831]
["BAIIIInsgesamt35 bis unter 45 JahreInsgesamtInsgesamt",503014,38900,"7,7",7.7333831662737023]
["BAIIIInsgesamt35 bis unter 45 JahreInsgesamtKeine Berufsausbildung",159723,15067,"9,4",9.4332062383000572]
["BAIIIInsgesamt35 bis unter 45 JahreInsgesamtBetriebliche/schulische Ausbildung",229999,16763,"7,3",7.2882925577937296]
["BAIIIInsgesamt35 bis unter 45 JahreInsgesamtAkademische Ausbildung",113292,7070,"6,2",6.2405112452776894]
["BAIIIInsgesamt35 bis unter 45 JahreDeutscheInsgesamt",357516,27001,"7,6",7.5523892636972887]
["BAIIIInsgesamt35 bis unter 45 JahreDeutscheKeine Berufsausbildung",78709,7834,"10,0",9.9531184489702582]
["BAIIIInsgesamt35 bis unter 45 JahreDeutscheBetriebliche/schulische Ausbildung",198341,14341,"7,2",7.2304768050982906]
["BAIIIInsgesamt35 bis unter 45 JahreDeutscheAkademische Ausbildung",80466,4826,"6,0",5.9975641886013964]
["BAIIIInsgesamt35 bis unter 45 JahreAusländerInsgesamt",145498,11899,"8,2",8.1781192868630512]
["BAIIIInsgesamt35 bis unter 45 JahreAusländerKeine Berufsausbildung",81014,7233,"8,9",8.9280865035672843]
["BAIIIInsgesamt35 bis unter 45 JahreAusländerBetriebliche/schulische Ausbildung",31658,2422,"7,7",7.6505148777560175]
["BAIIIInsgesamt35 bis unter 45 JahreAusländerAkademische Ausbildung",32826,2244,"6,8",6.8360445987936389]
["BAIIIInsgesamt45 bis unter 55 JahreInsgesamtInsgesamt",398047,36159,"9,1",9.0841031335495543]
["BAIIIInsgesamt45 bis unter 55 JahreInsgesamtKeine Berufsausbildung",130484,13265,"10,2",10.165997363661445]
["BAIIIInsgesamt45 bis unter 55 JahreInsgesamtBetriebliche/schulische Ausbildung",210921,18319,"8,7",8.6852423419194871]
["BAIIIInsgesamt45 bis unter 55 JahreInsgesamtAkademische Ausbildung",56642,4575,"8,1",8.0770453020726656]
["BAIIIInsgesamt45 bis unter 55 JahreDeutscheInsgesamt",297001,27041,"9,1",9.1046831492149849]
["BAIIIInsgesamt45 bis unter 55 JahreDeutscheKeine Berufsausbildung",66848,7191,"10,8",10.757240306366683]
["BAIIIInsgesamt45 bis unter 55 JahreDeutscheBetriebliche/schulische Ausbildung",185277,16247,"8,8",8.769032313778828]
["BAIIIInsgesamt45 bis unter 55 JahreDeutscheAkademische Ausbildung",44876,3603,"8,0",8.0287904447811762]
["BAIIIInsgesamt45 bis unter 55 JahreAusländerInsgesamt",101046,9118,"9,0",9.0236130079369783]
["BAIIIInsgesamt45 bis unter 55 JahreAusländerKeine Berufsausbildung",63636,6074,"9,5",9.5449116852096303]
["BAIIIInsgesamt45 bis unter 55 JahreAusländerBetriebliche/schulische Ausbildung",25644,2072,"8,1",8.0798627359226334]
["BAIIIInsgesamt45 bis unter 55 JahreAusländerAkademische Ausbildung",11766,972,"8,3",8.2610912799592047]
["BAIIIInsgesamt55 und älterInsgesamtInsgesamt",430909,107498,"24,9",24.946798511982809]
["BAIIIInsgesamt55 und älterInsgesamtKeine Berufsausbildung",119505,28232,"23,6",23.62411614576796]
["BAIIIInsgesamt55 und älterInsgesamtBetriebliche/schulische Ausbildung",253012,65133,"25,7",25.743047760580527]
["BAIIIInsgesamt55 und älterInsgesamtAkademische Ausbildung",58392,14133,"24,2",24.20365803534731]
["BAIIIInsgesamt55 und älterDeutscheInsgesamt",378430,98006,"25,9",25.898052479983086]
["BAIIIInsgesamt55 und älterDeutscheKeine Berufsausbildung",84609,21688,"25,6",25.633206869245591]
["BAIIIInsgesamt55 und älterDeutscheBetriebliche/schulische Ausbildung",240144,62921,"26,2",26.201362515823838]
["BAIIIInsgesamt55 und älterDeutscheAkademische Ausbildung",53677,13397,"25,0",24.958548354043629]
["BAIIIInsgesamt55 und älterAusländerInsgesamt",52479,9492,"18,1",18.087234893957582]
["BAIIIInsgesamt55 und älterAusländerKeine Berufsausbildung",34896,6544,"18,8",18.752865657955066]
["BAIIIInsgesamt55 und älterAusländerBetriebliche/schulische Ausbildung",12868,2212,"17,2",17.189928504818152]
["BAIIIInsgesamt55 und älterAusländerAkademische Ausbildung",4715,736,"15,6",15.609756097560975]
["BAIIIMännlichInsgesamtInsgesamtInsgesamt",1338821,137746,"10,3",10.288604675307603]
["BAIIIMännlichInsgesamtInsgesamtKeine Berufsausbildung",514791,50773,"9,9",9.86283753989483]
["BAIIIMännlichInsgesamtInsgesamtBetriebliche/schulische Ausbildung",645569,69374,"10,7",10.746178952211149]
["BAIIIMännlichInsgesamtInsgesamtAkademische Ausbildung",178461,17599,"9,9",9.8615383753313051]
["BAIIIMännlichInsgesamtDeutscheInsgesamt",992162,109456,"11,0",11.032069359640866]
["BAIIIMännlichInsgesamtDeutscheKeine Berufsausbildung",284976,30860,"10,8",10.828982089719837]
["BAIIIMännlichInsgesamtDeutscheBetriebliche/schulische Ausbildung",567522,63665,"11,2",11.218067317214134]
["BAIIIMännlichInsgesamtDeutscheAkademische Ausbildung",139664,14931,"10,7",10.690657578187651]
["BAIIIMännlichInsgesamtAusländerInsgesamt",346659,28290,"8,2",8.1607574013656059]
["BAIIIMännlichInsgesamtAusländerKeine Berufsausbildung",229815,19913,"8,7",8.6647955964580206]
["BAIIIMännlichInsgesamtAusländerBetriebliche/schulische Ausbildung",78047,5709,"7,3",7.3148231194024111]
["BAIIIMännlichInsgesamtAusländerAkademische Ausbildung",38797,2668,"6,9",6.8768203727092301]
["BAIIIMännlich15 bis unter 25 JahreInsgesamtInsgesamt",229157,7619,"3,3",3.3247947913439253]
["BAIIIMännlich15 bis unter 25 JahreInsgesamtKeine Berufsausbildung",121022,4866,"4,0",4.0207565566591201]
["BAIIIMännlich15 bis unter 25 JahreInsgesamtBetriebliche/schulische Ausbildung",104893,2709,"2,6",2.5826318248119513]
["BAIIIMännlich15 bis unter 25 JahreInsgesamtAkademische Ausbildung",3242,44,"1,4",1.3571869216533003]
["BAIIIMännlich15 bis unter 25 JahreDeutscheInsgesamt",182911,5866,"3,2",3.2070241811591433]
["BAIIIMännlich15 bis unter 25 JahreDeutscheKeine Berufsausbildung",86073,3430,"4,0",3.9849894856691415]
["BAIIIMännlich15 bis unter 25 JahreDeutscheBetriebliche/schulische Ausbildung",94009,2400,"2,6",2.5529470582603793]
["BAIIIMännlich15 bis unter 25 JahreDeutscheAkademische Ausbildung",2829,36,"1,3",1.2725344644750796]
["BAIIIMännlich15 bis unter 25 JahreAusländerInsgesamt",46246,1753,"3,8",3.7905981057821219]
["BAIIIMännlich15 bis unter 25 JahreAusländerKeine Berufsausbildung",34949,1436,"4,1",4.108844316003319]
["BAIIIMännlich15 bis unter 25 JahreAusländerBetriebliche/schulische Ausbildung",10884,309,"2,8",2.8390297684674755]
["BAIIIMännlich15 bis unter 25 JahreAusländerAkademische Ausbildung",413,8,"1,9",1.937046004842615]
["BAIIIMännlich25 bis unter 35 JahreInsgesamtInsgesamt",377890,24448,"6,5",6.4696075577549026]
["BAIIIMännlich25 bis unter 35 JahreInsgesamtKeine Berufsausbildung",147591,12401,"8,4",8.4022738513866013]
["BAIIIMännlich25 bis unter 35 JahreInsgesamtBetriebliche/schulische Ausbildung",166232,9315,"5,6",5.6036142259011505]
["BAIIIMännlich25 bis unter 35 JahreInsgesamtAkademische Ausbildung",64067,2732,"4,3",4.2642858257761409]
["BAIIIMännlich25 bis unter 35 JahreDeutscheInsgesamt",256305,16143,"6,3",6.2983554749224551]
["BAIIIMännlich25 bis unter 35 JahreDeutscheKeine Berufsausbildung",68290,6372,"9,3",9.3307951383804362]
["BAIIIMännlich25 bis unter 35 JahreDeutscheBetriebliche/schulische Ausbildung",140659,7918,"5,6",5.6292167582593367]
["BAIIIMännlich25 bis unter 35 JahreDeutscheAkademische Ausbildung",47356,1853,"3,9",3.9129149421403837]
["BAIIIMännlich25 bis unter 35 JahreAusländerInsgesamt",121585,8305,"6,8",6.8306123288234568]
["BAIIIMännlich25 bis unter 35 JahreAusländerKeine Berufsausbildung",79301,6029,"7,6",7.6026784025422121]
["BAIIIMännlich25 bis unter 35 JahreAusländerBetriebliche/schulische Ausbildung",25573,1397,"5,5",5.4627927892699333]
["BAIIIMännlich25 bis unter 35 JahreAusländerAkademische Ausbildung",16711,879,"5,3",5.2600083777152769]
["BAIIIMännlich35 bis unter 45 JahreInsgesamtInsgesamt",279413,22700,"8,1",8.1241746089122557]
["BAIIIMännlich35 bis unter 45 JahreInsgesamtKeine Berufsausbildung",103065,9904,"9,6",9.6094697520981907]
["BAIIIMännlich35 bis unter 45 JahreInsgesamtBetriebliche/schulische Ausbildung",126467,9659,"7,6",7.6375655309290176]
["BAIIIMännlich35 bis unter 45 JahreInsgesamtAkademische Ausbildung",49881,3137,"6,3",6.2889677432288851]
["BAIIIMännlich35 bis unter 45 JahreDeutscheInsgesamt",192236,15665,"8,1",8.148837886764186]
["BAIIIMännlich35 bis unter 45 JahreDeutscheKeine Berufsausbildung",48600,5168,"10,6",10.633744855967079]
["BAIIIMännlich35 bis unter 45 JahreDeutscheBetriebliche/schulische Ausbildung",107852,8279,"7,7",7.6762600600823347]
["BAIIIMännlich35 bis unter 45 JahreDeutscheAkademische Ausbildung",35784,2218,"6,2",6.1983009166107754]
["BAIIIMännlich35 bis unter 45 JahreAusländerInsgesamt",87177,7035,"8,1",8.0697890498640685]
["BAIIIMännlich35 bis unter 45 JahreAusländerKeine Berufsausbildung",54465,4736,"8,7",8.6954925181309086]
["BAIIIMännlich35 bis unter 45 JahreAusländerBetriebliche/schulische Ausbildung",18615,1380,"7,4",7.4133763094278811]
["BAIIIMännlich35 bis unter 45 JahreAusländerAkademische Ausbildung",14097,919,"6,5",6.5191175427395898]
["BAIIIMännlich45 bis unter 55 JahreInsgesamtInsgesamt",212613,20533,"9,7",9.6574527427767833]
["BAIIIMännlich45 bis unter 55 JahreInsgesamtKeine Berufsausbildung",75370,7811,"10,4",10.363539869974792]
["BAIIIMännlich45 bis unter 55 JahreInsgesamtBetriebliche/schulische Ausbildung",110228,10268,"9,3",9.3152375077112897]
["BAIIIMännlich45 bis unter 55 JahreInsgesamtAkademische Ausbildung",27015,2454,"9,1",9.0838423098278742]
["BAIIIMännlich45 bis unter 55 JahreDeutscheInsgesamt",154181,15291,"9,9",9.9175644210376106]
["BAIIIMännlich45 bis unter 55 JahreDeutscheKeine Berufsausbildung",36593,4228,"11,6",11.554122373131474]
["BAIIIMännlich45 bis unter 55 JahreDeutscheBetriebliche/schulische Ausbildung",95583,9062,"9,5",9.4807654080746584]
["BAIIIMännlich45 bis unter 55 JahreDeutscheAkademische Ausbildung",22005,2001,"9,1",9.0933878663940018]
["BAIIIMännlich45 bis unter 55 JahreAusländerInsgesamt",58432,5242,"9,0",8.9711117196056946]
["BAIIIMännlich45 bis unter 55 JahreAusländerKeine Berufsausbildung",38777,3583,"9,2",9.2400134100110893]
["BAIIIMännlich45 bis unter 55 JahreAusländerBetriebliche/schulische Ausbildung",14645,1206,"8,2",8.2348924547627167]
["BAIIIMännlich45 bis unter 55 JahreAusländerAkademische Ausbildung",5010,453,"9,0",9.0419161676646702]
["BAIIIMännlich55 und älterInsgesamtInsgesamt",239748,62446,"26,0",26.046515507950012]
["BAIIIMännlich55 und älterInsgesamtKeine Berufsausbildung",67743,15791,"23,3",23.310157507048697]
["BAIIIMännlich55 und älterInsgesamtBetriebliche/schulische Ausbildung",137749,37423,"27,2",27.167529346855513]
["BAIIIMännlich55 und älterInsgesamtAkademische Ausbildung",34256,9232,"27,0",26.950023353573098]
["BAIIIMännlich55 und älterDeutscheInsgesamt",206529,56491,"27,4",27.352575183146193]
["BAIIIMännlich55 und älterDeutscheKeine Berufsausbildung",45420,11662,"25,7",25.675913694407747]
["BAIIIMännlich55 und älterDeutscheBetriebliche/schulische Ausbildung",129419,36006,"27,8",27.821262720311545]
["BAIIIMännlich55 und älterDeutscheAkademische Ausbildung",31690,8823,"27,8",27.841590407068477]
["BAIIIMännlich55 und älterAusländerInsgesamt",33219,5955,"17,9",17.926487853336944]
["BAIIIMännlich55 und älterAusländerKeine Berufsausbildung",22323,4129,"18,5",18.4966178381042]
["BAIIIMännlich55 und älterAusländerBetriebliche/schulische Ausbildung",8330,1417,"17,0",17.010804321728692]
["BAIIIMännlich55 und älterAusländerAkademische Ausbildung",2566,409,"15,9",15.939204988308653]
["BAIIIWeiblichInsgesamtInsgesamtInsgesamt",1016402,96223,"9,5",9.4670219066865275]
["BAIIIWeiblichInsgesamtInsgesamtKeine Berufsausbildung",290220,30450,"10,5",10.49204052098408]
["BAIIIWeiblichInsgesamtInsgesamtBetriebliche/schulische Ausbildung",514857,51536,"10,0",10.009769703043759]
["BAIIIWeiblichInsgesamtInsgesamtAkademische Ausbildung",211325,14237,"6,7",6.7370164438660822]
["BAIIIWeiblichInsgesamtDeutscheInsgesamt",808150,78592,"9,7",9.7249273030996708]
["BAIIIWeiblichInsgesamtDeutscheKeine Berufsausbildung",185552,20348,"11,0",10.96619815469518]
["BAIIIWeiblichInsgesamtDeutscheBetriebliche/schulische Ausbildung",462957,47487,"10,3",10.257324114334592]
["BAIIIWeiblichInsgesamtDeutscheAkademische Ausbildung",159641,10757,"6,7",6.7382439348287724]
["BAIIIWeiblichInsgesamtAusländerInsgesamt",208252,17631,"8,5",8.4661851987015737]
["BAIIIWeiblichInsgesamtAusländerKeine Berufsausbildung",104668,10102,"9,7",9.6514694080330177]
["BAIIIWeiblichInsgesamtAusländerBetriebliche/schulische Ausbildung",51900,4049,"7,8",7.8015414258188827]
["BAIIIWeiblichInsgesamtAusländerAkademische Ausbildung",51684,3480,"6,7",6.7332249825864876]
["BAIIIWeiblich15 bis unter 25 JahreInsgesamtInsgesamt",144060,4058,"2,8",2.8168818547827295]
["BAIIIWeiblich15 bis unter 25 JahreInsgesamtKeine Berufsausbildung",63564,2285,"3,6",3.5948020892328993]
["BAIIIWeiblich15 bis unter 25 JahreInsgesamtBetriebliche/schulische Ausbildung",74767,1715,"2,3",2.2937927160378244]
["BAIIIWeiblich15 bis unter 25 JahreInsgesamtAkademische Ausbildung",5729,58,"1,0",1.0123930877989178]
["BAIIIWeiblich15 bis unter 25 JahreDeutscheInsgesamt",122763,3311,"2,7",2.6970667057663955]
["BAIIIWeiblich15 bis unter 25 JahreDeutscheKeine Berufsausbildung",50557,1792,"3,5",3.5445141127835909]
["BAIIIWeiblich15 bis unter 25 JahreDeutscheBetriebliche/schulische Ausbildung",67400,1483,"2,2",2.2002967359050443]
["BAIIIWeiblich15 bis unter 25 JahreDeutscheAkademische Ausbildung",4806,36,"0,7",0.74906367041198507]
["BAIIIWeiblich15 bis unter 25 JahreAusländerInsgesamt",21297,747,"3,5",3.507536272714467]
["BAIIIWeiblich15 bis unter 25 JahreAusländerKeine Berufsausbildung",13007,493,"3,8",3.7902667794264628]
["BAIIIWeiblich15 bis unter 25 JahreAusländerBetriebliche/schulische Ausbildung",7367,232,"3,1",3.1491787701913942]
["BAIIIWeiblich15 bis unter 25 JahreAusländerAkademische Ausbildung",923,22,"2,4",2.3835319609967498]
["BAIIIWeiblich25 bis unter 35 JahreInsgesamtInsgesamt",272162,15287,"5,6",5.6168752434211973]
["BAIIIWeiblich25 bis unter 35 JahreInsgesamtKeine Berufsausbildung",63130,5107,"8,1",8.0896562648503085]
["BAIIIWeiblich25 bis unter 35 JahreInsgesamtBetriebliche/schulische Ausbildung",120603,6956,"5,8",5.7676840542938406]
["BAIIIWeiblich25 bis unter 35 JahreInsgesamtAkademische Ausbildung",88429,3224,"3,6",3.6458627825713283]
["BAIIIWeiblich25 bis unter 35 JahreDeutscheInsgesamt",205394,10680,"5,2",5.1997624078600158]
["BAIIIWeiblich25 bis unter 35 JahreDeutscheKeine Berufsausbildung",35448,2901,"8,2",8.1838185511171293]
["BAIIIWeiblich25 bis unter 35 JahreDeutscheBetriebliche/schulische Ausbildung",104650,5842,"5,6",5.5824175824175821]
["BAIIIWeiblich25 bis unter 35 JahreDeutscheAkademische Ausbildung",65296,1937,"3,0",2.9664910561136977]
["BAIIIWeiblich25 bis unter 35 JahreAusländerInsgesamt",66768,4607,"6,9",6.9000119817876824]
["BAIIIWeiblich25 bis unter 35 JahreAusländerKeine Berufsausbildung",27682,2206,"8,0",7.9690773788021101]
["BAIIIWeiblich25 bis unter 35 JahreAusländerBetriebliche/schulische Ausbildung",15953,1114,"7,0",6.9830125995110643]
["BAIIIWeiblich25 bis unter 35 JahreAusländerAkademische Ausbildung",23133,1287,"5,6",5.5634807417974326]
["BAIIIWeiblich35 bis unter 45 JahreInsgesamtInsgesamt",223594,16200,"7,2",7.2452749179316083]
["BAIIIWeiblich35 bis unter 45 JahreInsgesamtKeine Berufsausbildung",56656,5163,"9,1",9.1128918384637103]
["BAIIIWeiblich35 bis unter 45 JahreInsgesamtBetriebliche/schulische Ausbildung",103532,7104,"6,9",6.8616466406521655]
["BAIIIWeiblich35 bis unter 45 JahreInsgesamtAkademische Ausbildung",63406,3933,"6,2",6.2028830079172312]
["BAIIIWeiblich35 bis unter 45 JahreDeutscheInsgesamt",165279,11336,"6,9",6.8587055826814058]
["BAIIIWeiblich35 bis unter 45 JahreDeutscheKeine Berufsausbildung",30108,2666,"8,9",8.8547894247376107]
["BAIIIWeiblich35 bis unter 45 JahreDeutscheBetriebliche/schulische Ausbildung",90489,6062,"6,7",6.6991568035893856]
["BAIIIWeiblich35 bis unter 45 JahreDeutscheAkademische Ausbildung",44682,2608,"5,8",5.8368022917505931]
["BAIIIWeiblich35 bis unter 45 JahreAusländerInsgesamt",58315,4864,"8,3",8.3409071422447045]
["BAIIIWeiblich35 bis unter 45 JahreAusländerKeine Berufsausbildung",26548,2497,"9,4",9.4056049419918644]
["BAIIIWeiblich35 bis unter 45 JahreAusländerBetriebliche/schulische Ausbildung",13043,1042,"8,0",7.9889595951851566]
["BAIIIWeiblich35 bis unter 45 JahreAusländerAkademische Ausbildung",18724,1325,"7,1",7.0764793847468495]
["BAIIIWeiblich45 bis unter 55 JahreInsgesamtInsgesamt",185430,15626,"8,4",8.4268996386776678]
["BAIIIWeiblich45 bis unter 55 JahreInsgesamtKeine Berufsausbildung",55112,5454,"9,9",9.8962113514298142]
["BAIIIWeiblich45 bis unter 55 JahreInsgesamtBetriebliche/schulische Ausbildung",100692,8051,"8,0",7.9956699638501565]
["BAIIIWeiblich45 bis unter 55 JahreInsgesamtAkademische Ausbildung",29626,2121,"7,2",7.1592520083710252]
["BAIIIWeiblich45 bis unter 55 JahreDeutscheInsgesamt",142817,11750,"8,2",8.2273118746367722]
["BAIIIWeiblich45 bis unter 55 JahreDeutscheKeine Berufsausbildung",30253,2963,"9,8",9.7940700095858251]
["BAIIIWeiblich45 bis unter 55 JahreDeutscheBetriebliche/schulische Ausbildung",89693,7185,"8,0",8.0106585798222838]
["BAIIIWeiblich45 bis unter 55 JahreDeutscheAkademische Ausbildung",22871,1602,"7,0",7.0045035197411565]
["BAIIIWeiblich45 bis unter 55 JahreAusländerInsgesamt",42613,3876,"9,1",9.095815830849741]
["BAIIIWeiblich45 bis unter 55 JahreAusländerKeine Berufsausbildung",24859,2491,"10,0",10.020515708596484]
["BAIIIWeiblich45 bis unter 55 JahreAusländerBetriebliche/schulische Ausbildung",10999,866,"7,9",7.8734430402763884]
["BAIIIWeiblich45 bis unter 55 JahreAusländerAkademische Ausbildung",6755,519,"7,7",7.6831976313841599]
["BAIIIWeiblich55 und älterInsgesamtInsgesamt",191156,45052,"23,6",23.568185147209608]
["BAIIIWeiblich55 und älterInsgesamtKeine Berufsausbildung",51758,12441,"24,0",24.036863866455427]
["BAIIIWeiblich55 und älterInsgesamtBetriebliche/schulische Ausbildung",115263,27710,"24,0",24.040672201834067]
["BAIIIWeiblich55 und älterInsgesamtAkademische Ausbildung",24135,4901,"20,3",20.306608659622956]
["BAIIIWeiblich55 und älterDeutscheInsgesamt",171897,41515,"24,2",24.151090478600558]
["BAIIIWeiblich55 und älterDeutscheKeine Berufsausbildung",39186,10026,"25,6",25.585668350941663]
["BAIIIWeiblich55 und älterDeutscheBetriebliche/schulische Ausbildung",110725,26915,"24,3",24.307970196432606]
["BAIIIWeiblich55 und älterDeutscheAkademische Ausbildung",21986,4574,"20,8",20.804148094241789]
["BAIIIWeiblich55 und älterAusländerInsgesamt",19259,3537,"18,4",18.365439534762967]
["BAIIIWeiblich55 und älterAusländerKeine Berufsausbildung",12572,2415,"19,2",19.20935412026726]
["BAIIIWeiblich55 und älterAusländerBetriebliche/schulische Ausbildung",4538,795,"17,5",17.518730718378141]
["BAIIIWeiblich55 und älterAusländerAkademische Ausbildung",2149,327,"15,2",15.216379711493719]
["BAIIInsgesamtInsgesamtInsgesamtInsgesamt",2239055,423511,"18,9",18.914720719231997]
["BAIIInsgesamtInsgesamtInsgesamtKeine Berufsausbildung",1652077,305332,"18,5",18.481705150546858]
["BAIIInsgesamtInsgesamtInsgesamtBetriebliche/schulische Ausbildung",448903,96736,"21,5",21.549421589964872]
["BAIIInsgesamtInsgesamtInsgesamtAkademische Ausbildung",138075,21443,"15,5",15.529965598406664]
["BAIIInsgesamtInsgesamtDeutscheInsgesamt",1028582,215911,"21,0",20.991131480037566]
["BAIIInsgesamtInsgesamtDeutscheKeine Berufsausbildung",625572,130532,"20,9",20.866023415370254]
["BAIIInsgesamtInsgesamtDeutscheBetriebliche/schulische Ausbildung",359739,78179,"21,7",21.732144693791888]
["BAIIInsgesamtInsgesamtDeutscheAkademische Ausbildung",43271,7200,"16,6",16.639319636708187]
["BAIIInsgesamtInsgesamtAusländerInsgesamt",1210452,207599,"17,2",17.150535502440412]
["BAIIInsgesamtInsgesamtAusländerKeine Berufsausbildung",1026487,174799,"17,0",17.028856673294449]
["BAIIInsgesamtInsgesamtAusländerBetriebliche/schulische Ausbildung",89162,18557,"20,8",20.81267804670151]
["BAIIInsgesamtInsgesamtAusländerAkademische Ausbildung",94803,14243,"15,0",15.023786167104417]
["BAIIInsgesamt15 bis unter 25 JahreInsgesamtInsgesamt",369634,40021,"10,8",10.827196632344426]
["BAIIInsgesamt15 bis unter 25 JahreInsgesamtKeine Berufsausbildung",345112,37590,"10,9",10.892116182572614]
["BAIIInsgesamt15 bis unter 25 JahreInsgesamtBetriebliche/schulische Ausbildung",18733,1992,"10,6",10.633641167992312]
["BAIIInsgesamt15 bis unter 25 JahreInsgesamtAkademische Ausbildung",5789,439,"7,6",7.5833477284505095]
["BAIIInsgesamt15 bis unter 25 JahreDeutscheInsgesamt",175759,22962,"13,1",13.064480339555869]
["BAIIInsgesamt15 bis unter 25 JahreDeutscheKeine Berufsausbildung",161492,21418,"13,3",13.26257647437644]
["BAIIInsgesamt15 bis unter 25 JahreDeutscheBetriebliche/schulische Ausbildung",12872,1458,"11,3",11.326911124922312]
["BAIIInsgesamt15 bis unter 25 JahreDeutscheAkademische Ausbildung",1395,86,"6,2",6.1648745519713266]
["BAIIInsgesamt15 bis unter 25 JahreAusländerInsgesamt",193871,17059,"8,8",8.7991499502246349]
["BAIIInsgesamt15 bis unter 25 JahreAusländerKeine Berufsausbildung",183617,16172,"8,8",8.8074633612356159]
["BAIIInsgesamt15 bis unter 25 JahreAusländerBetriebliche/schulische Ausbildung",5860,534,"9,1",9.112627986348123]
["BAIIInsgesamt15 bis unter 25 JahreAusländerAkademische Ausbildung",4394,353,"8,0",8.0336822940373231]
["BAIIInsgesamt25 bis unter 35 JahreInsgesamtInsgesamt",563166,108852,"19,3",19.328581626021457]
["BAIIInsgesamt25 bis unter 35 JahreInsgesamtKeine Berufsausbildung",426590,84707,"19,9",19.85677113856396]
["BAIIInsgesamt25 bis unter 35 JahreInsgesamtBetriebliche/schulische Ausbildung",90492,18701,"20,7",20.665915219024885]
["BAIIInsgesamt25 bis unter 35 JahreInsgesamtAkademische Ausbildung",46084,5444,"11,8",11.813210658796979]
["BAIIInsgesamt25 bis unter 35 JahreDeutscheInsgesamt",245949,55257,"22,5",22.466852884134518]
["BAIIInsgesamt25 bis unter 35 JahreDeutscheKeine Berufsausbildung",159411,38823,"24,4",24.354028266556259]
["BAIIInsgesamt25 bis unter 35 JahreDeutscheBetriebliche/schulische Ausbildung",69634,14712,"21,1",21.127610075537813]
["BAIIInsgesamt25 bis unter 35 JahreDeutscheAkademische Ausbildung",16904,1722,"10,2",10.186938002839565]
["BAIIInsgesamt25 bis unter 35 JahreAusländerInsgesamt",317216,53595,"16,9",16.895427721174215]
["BAIIInsgesamt25 bis unter 35 JahreAusländerKeine Berufsausbildung",267178,45884,"17,2",17.173569680138336]
["BAIIInsgesamt25 bis unter 35 JahreAusländerBetriebliche/schulische Ausbildung",20858,3989,"19,1",19.124556525074311]
["BAIIInsgesamt25 bis unter 35 JahreAusländerAkademische Ausbildung",29180,3722,"12,8",12.755311857436599]
["BAIIInsgesamt35 bis unter 45 JahreInsgesamtInsgesamt",569036,117523,"20,7",20.652999107262108]
["BAIIInsgesamt35 bis unter 45 JahreInsgesamtKeine Berufsausbildung",404236,83201,"20,6",20.58228361650125]
["BAIIInsgesamt35 bis unter 45 JahreInsgesamtBetriebliche/schulische Ausbildung",117142,26791,"22,9",22.870533199023406]
["BAIIInsgesamt35 bis unter 45 JahreInsgesamtAkademische Ausbildung",47658,7531,"15,8",15.802173821813756]
["BAIIInsgesamt35 bis unter 45 JahreDeutscheInsgesamt",223156,54207,"24,3",24.291078886518847]
["BAIIInsgesamt35 bis unter 45 JahreDeutscheKeine Berufsausbildung",122381,31116,"25,4",25.425515398632143]
["BAIIInsgesamt35 bis unter 45 JahreDeutscheBetriebliche/schulische Ausbildung",89625,21060,"23,5",23.497907949790793]
["BAIIInsgesamt35 bis unter 45 JahreDeutscheAkademische Ausbildung",11150,2031,"18,2",18.215246636771301]
["BAIIInsgesamt35 bis unter 45 JahreAusländerInsgesamt",345874,63316,"18,3",18.306088344310357]
["BAIIInsgesamt35 bis unter 45 JahreAusländerKeine Berufsausbildung",281849,52085,"18,5",18.479753343102157]
["BAIIInsgesamt35 bis unter 45 JahreAusländerBetriebliche/schulische Ausbildung",27517,5731,"20,8",20.827125049969112]
["BAIIInsgesamt35 bis unter 45 JahreAusländerAkademische Ausbildung",36508,5500,"15,1",15.065191190971841]
["BAIIInsgesamt45 bis unter 55 JahreInsgesamtInsgesamt",417563,86764,"20,8",20.778660944576028]
["BAIIInsgesamt45 bis unter 55 JahreInsgesamtKeine Berufsausbildung",281627,58250,"20,7",20.683386181012477]
["BAIIInsgesamt45 bis unter 55 JahreInsgesamtBetriebliche/schulische Ausbildung",112244,24177,"21,5",21.539681408360359]
["BAIIInsgesamt45 bis unter 55 JahreInsgesamtAkademische Ausbildung",23692,4337,"18,3",18.305757217626205]
["BAIIInsgesamt45 bis unter 55 JahreDeutscheInsgesamt",191640,41557,"21,7",21.684930077228138]
["BAIIInsgesamt45 bis unter 55 JahreDeutscheKeine Berufsausbildung",95162,20832,"21,9",21.891090981694376]
["BAIIInsgesamt45 bis unter 55 JahreDeutscheBetriebliche/schulische Ausbildung",89525,19188,"21,4",21.433119240435634]
["BAIIInsgesamt45 bis unter 55 JahreDeutscheAkademische Ausbildung",6953,1537,"22,1",22.10556594275852]
["BAIIInsgesamt45 bis unter 55 JahreAusländerInsgesamt",225914,45206,"20,0",20.01026939454837]
["BAIIInsgesamt45 bis unter 55 JahreAusländerKeine Berufsausbildung",186458,37417,"20,1",20.067253751515089]
["BAIIInsgesamt45 bis unter 55 JahreAusländerBetriebliche/schulische Ausbildung",22718,4989,"22,0",21.960559908442644]
["BAIIInsgesamt45 bis unter 55 JahreAusländerAkademische Ausbildung",16738,2800,"16,7",16.728402437567212]
["BAIIInsgesamt55 und älterInsgesamtInsgesamt",319656,70351,"22,0",22.008346472457895]
["BAIIInsgesamt55 und älterInsgesamtKeine Berufsausbildung",194512,41584,"21,4",21.378629596117463]
["BAIIInsgesamt55 und älterInsgesamtBetriebliche/schulische Ausbildung",110292,25075,"22,7",22.735103180647734]
["BAIIInsgesamt55 und älterInsgesamtAkademische Ausbildung",14852,3692,"24,9",24.85860490169674]
["BAIIInsgesamt55 und älterDeutscheInsgesamt",192078,41928,"21,8",21.82863211820198]
["BAIIInsgesamt55 und älterDeutscheKeine Berufsausbildung",87126,18343,"21,1",21.053416890480452]
["BAIIInsgesamt55 und älterDeutscheBetriebliche/schulische Ausbildung",98083,21761,"22,2",22.186311593242458]
["BAIIInsgesamt55 und älterDeutscheAkademische Ausbildung",6869,1824,"26,6",26.554083563837533]
["BAIIInsgesamt55 und älterAusländerInsgesamt",127577,28423,"22,3",22.279094194094547]
["BAIIInsgesamt55 und älterAusländerKeine Berufsausbildung",107385,23241,"21,6",21.642687526190809]
["BAIIInsgesamt55 und älterAusländerBetriebliche/schulische Ausbildung",12209,3314,"27,1",27.143910230158081]
["BAIIInsgesamt55 und älterAusländerAkademische Ausbildung",7983,1868,"23,4",23.399724414380561]
["BAIIMännlichInsgesamtInsgesamtInsgesamt",1072618,211536,"19,7",19.72146654260883]
["BAIIMännlichInsgesamtInsgesamtKeine Berufsausbildung",779129,148546,"19,1",19.065648949018712]
["BAIIMännlichInsgesamtInsgesamtBetriebliche/schulische Ausbildung",238554,53787,"22,5",22.54709625493599]
["BAIIMännlichInsgesamtInsgesamtAkademische Ausbildung",54935,9203,"16,8",16.752525712205333]
["BAIIMännlichInsgesamtDeutscheInsgesamt",549707,120700,"22,0",21.957151719006671]
["BAIIMännlichInsgesamtDeutscheKeine Berufsausbildung",329484,70984,"21,5",21.543989996479343]
["BAIIMännlichInsgesamtDeutscheBetriebliche/schulische Ausbildung",198952,45717,"23,0",22.978909485705096]
["BAIIMännlichInsgesamtDeutscheAkademische Ausbildung",21271,3999,"18,8",18.800244464294106]
["BAIIMännlichInsgesamtAusländerInsgesamt",522899,90836,"17,4",17.371614786029426]
["BAIIMännlichInsgesamtAusländerKeine Berufsausbildung",449635,77562,"17,2",17.249991659901919]
["BAIIMännlichInsgesamtAusländerBetriebliche/schulische Ausbildung",39600,8070,"20,4",20.378787878787879]
["BAIIMännlichInsgesamtAusländerAkademische Ausbildung",33664,5204,"15,5",15.458650190114067]
["BAIIMännlich15 bis unter 25 JahreInsgesamtInsgesamt",194553,22367,"11,5",11.496610178203369]
["BAIIMännlich15 bis unter 25 JahreInsgesamtKeine Berufsausbildung",184704,21283,"11,5",11.522760741510742]
["BAIIMännlich15 bis unter 25 JahreInsgesamtBetriebliche/schulische Ausbildung",8273,957,"11,6",11.567750513719329]
["BAIIMännlich15 bis unter 25 JahreInsgesamtAkademische Ausbildung",1576,127,"8,1",8.0583756345177662]
["BAIIMännlich15 bis unter 25 JahreDeutscheInsgesamt",92845,12668,"13,6",13.644245785987399]
["BAIIMännlich15 bis unter 25 JahreDeutscheKeine Berufsausbildung",86618,11927,"13,8",13.769655267958161]
["BAIIMännlich15 bis unter 25 JahreDeutscheBetriebliche/schulische Ausbildung",5732,706,"12,3",12.316817864619679]
["BAIIMännlich15 bis unter 25 JahreDeutscheAkademische Ausbildung",495,35,"7,1",7.0707070707070701]
["BAIIMännlich15 bis unter 25 JahreAusländerInsgesamt",101705,9699,"9,5",9.5364043065729316]
["BAIIMännlich15 bis unter 25 JahreAusländerKeine Berufsausbildung",98084,9356,"9,5",9.5387626932017451]
["BAIIMännlich15 bis unter 25 JahreAusländerBetriebliche/schulische Ausbildung",2540,251,"9,9",9.8818897637795278]
["BAIIMännlich15 bis unter 25 JahreAusländerAkademische Ausbildung",1081,92,"8,5",8.5106382978723403]
["BAIIMännlich25 bis unter 35 JahreInsgesamtInsgesamt",276018,54342,"19,7",19.687846444797078]
["BAIIMännlich25 bis unter 35 JahreInsgesamtKeine Berufsausbildung",210204,42365,"20,2",20.154231127856747]
["BAIIMännlich25 bis unter 35 JahreInsgesamtBetriebliche/schulische Ausbildung",46772,9747,"20,8",20.839391088685538]
["BAIIMännlich25 bis unter 35 JahreInsgesamtAkademische Ausbildung",19042,2230,"11,7",11.710954731645835]
["BAIIMännlich25 bis unter 35 JahreDeutscheInsgesamt",131108,29866,"22,8",22.779693077462856]
["BAIIMännlich25 bis unter 35 JahreDeutscheKeine Berufsausbildung",86249,20978,"24,3",24.322600841748891]
["BAIIMännlich25 bis unter 35 JahreDeutscheBetriebliche/schulische Ausbildung",36962,7995,"21,6",21.630323034467832]
["BAIIMännlich25 bis unter 35 JahreDeutscheAkademische Ausbildung",7897,893,"11,3",11.308091680384956]
["BAIIMännlich25 bis unter 35 JahreAusländerInsgesamt",144909,24476,"16,9",16.890600307779366]
["BAIIMännlich25 bis unter 35 JahreAusländerKeine Berufsausbildung",123954,21387,"17,3",17.253981315649352]
["BAIIMännlich25 bis unter 35 JahreAusländerBetriebliche/schulische Ausbildung",9810,1752,"17,9",17.859327217125383]
["BAIIMännlich25 bis unter 35 JahreAusländerAkademische Ausbildung",11145,1337,"12,0",11.99641094661283]
["BAIIMännlich35 bis unter 45 JahreInsgesamtInsgesamt",251903,55399,"22,0",21.992195408550117]
["BAIIMännlich35 bis unter 45 JahreInsgesamtKeine Berufsausbildung",174442,38083,"21,8",21.831325024936653]
["BAIIMännlich35 bis unter 45 JahreInsgesamtBetriebliche/schulische Ausbildung",59890,14324,"23,9",23.917181499415598]
["BAIIMännlich35 bis unter 45 JahreInsgesamtAkademische Ausbildung",17571,2992,"17,0",17.028057594900687]
["BAIIMännlich35 bis unter 45 JahreDeutscheInsgesamt",118453,29999,"25,3",25.325656589533402]
["BAIIMännlich35 bis unter 45 JahreDeutscheKeine Berufsausbildung",64772,17002,"26,2",26.248996479960478]
["BAIIMännlich35 bis unter 45 JahreDeutscheBetriebliche/schulische Ausbildung",48338,11916,"24,7",24.651412967023873]
["BAIIMännlich35 bis unter 45 JahreDeutscheAkademische Ausbildung",5343,1081,"20,2",20.232079356166949]
["BAIIMännlich35 bis unter 45 JahreAusländerInsgesamt",133446,25400,"19,0",19.033916340692116]
["BAIIMännlich35 bis unter 45 JahreAusländerKeine Berufsausbildung",109666,21081,"19,2",19.22291320919884]
["BAIIMännlich35 bis unter 45 JahreAusländerBetriebliche/schulische Ausbildung",11552,2408,"20,8",20.844875346260388]
["BAIIMännlich35 bis unter 45 JahreAusländerAkademische Ausbildung",12228,1911,"15,6",15.628066732090284]
["BAIIMännlich45 bis unter 55 JahreInsgesamtInsgesamt",193588,43436,"22,4",22.437341157509763]
["BAIIMännlich45 bis unter 55 JahreInsgesamtKeine Berufsausbildung",122534,27239,"22,2",22.229748477973459]
["BAIIMännlich45 bis unter 55 JahreInsgesamtBetriebliche/schulische Ausbildung",61424,14212,"23,1",23.137535816618911]
["BAIIMännlich45 bis unter 55 JahreInsgesamtAkademische Ausbildung",9630,1985,"20,6",20.612668743509865]
["BAIIMännlich45 bis unter 55 JahreDeutscheInsgesamt",103314,24290,"23,5",23.510850417174826]
["BAIIMännlich45 bis unter 55 JahreDeutscheKeine Berufsausbildung",48205,11420,"23,7",23.690488538533348]
["BAIIMännlich45 bis unter 55 JahreDeutscheBetriebliche/schulische Ausbildung",51439,11965,"23,3",23.260561052897607]
["BAIIMännlich45 bis unter 55 JahreDeutscheAkademische Ausbildung",3670,905,"24,7",24.65940054495913]
["BAIIMännlich45 bis unter 55 JahreAusländerInsgesamt",90271,19146,"21,2",21.209469264769417]
["BAIIMännlich45 bis unter 55 JahreAusländerKeine Berufsausbildung",74327,15819,"21,3",21.282979267291832]
["BAIIMännlich45 bis unter 55 JahreAusländerBetriebliche/schulische Ausbildung",9984,2247,"22,5",22.506009615384613]
["BAIIMännlich45 bis unter 55 JahreAusländerAkademische Ausbildung",5960,1080,"18,1",18.120805369127517]
["BAIIMännlich55 und älterInsgesamtInsgesamt",156556,35992,"23,0",22.989856664707837]
["BAIIMännlich55 und älterInsgesamtKeine Berufsausbildung",87245,19576,"22,4",22.437962060863086]
["BAIIMännlich55 und älterInsgesamtBetriebliche/schulische Ausbildung",62195,14547,"23,4",23.389339979097997]
["BAIIMännlich55 und älterInsgesamtAkademische Ausbildung",7116,1869,"26,3",26.264755480607082]
["BAIIMännlich55 und älterDeutscheInsgesamt",103987,23877,"23,0",22.961524036658428]
["BAIIMännlich55 und älterDeutscheKeine Berufsausbildung",43640,9657,"22,1",22.128780934922091]
["BAIIMännlich55 und älterDeutscheBetriebliche/schulische Ausbildung",56481,13135,"23,3",23.255608080593472]
["BAIIMännlich55 und älterDeutscheAkademische Ausbildung",3866,1085,"28,1",28.065183652353852]
["BAIIMännlich55 und älterAusländerInsgesamt",52568,12115,"23,0",23.046339978694263]
["BAIIMännlich55 und älterAusländerKeine Berufsausbildung",43604,9919,"22,7",22.74791303550133]
["BAIIMännlich55 und älterAusländerBetriebliche/schulische Ausbildung",5714,1412,"24,7",24.711235561778089]
["BAIIMännlich55 und älterAusländerAkademische Ausbildung",3250,784,"24,1",24.123076923076923]
["BAIIWeiblichInsgesamtInsgesamtInsgesamt",1166423,211975,"18,2",18.173081292121299]
["BAIIWeiblichInsgesamtInsgesamtKeine Berufsausbildung",872935,156786,"18,0",17.960787458401828]
["BAIIWeiblichInsgesamtInsgesamtBetriebliche/schulische Ausbildung",210348,42949,"20,4",20.41806910453154]
["BAIIWeiblichInsgesamtInsgesamtAkademische Ausbildung",83140,12240,"14,7",14.722155400529227]
["BAIIWeiblichInsgesamtDeutscheInsgesamt",478870,95211,"19,9",19.882431557625242]
["BAIIWeiblichInsgesamtDeutscheKeine Berufsausbildung",296083,59548,"20,1",20.111928074222433]
["BAIIWeiblichInsgesamtDeutscheBetriebliche/schulische Ausbildung",160787,32462,"20,2",20.189443176376198]
["BAIIWeiblichInsgesamtDeutscheAkademische Ausbildung",22000,3201,"14,6",14.549999999999999]
["BAIIWeiblichInsgesamtAusländerInsgesamt",687544,116763,"17,0",16.982622203088095]
["BAIIWeiblichInsgesamtAusländerKeine Berufsausbildung",576844,97237,"16,9",16.856723828279396]
["BAIIWeiblichInsgesamtAusländerBetriebliche/schulische Ausbildung",49561,10487,"21,2",21.15978289380763]
["BAIIWeiblichInsgesamtAusländerAkademische Ausbildung",61139,9039,"14,8",14.784343872160161]
["BAIIWeiblich15 bis unter 25 JahreInsgesamtInsgesamt",175076,17654,"10,1",10.083620827526332]
["BAIIWeiblich15 bis unter 25 JahreInsgesamtKeine Berufsausbildung",160403,16307,"10,2",10.166268710684962]
["BAIIWeiblich15 bis unter 25 JahreInsgesamtBetriebliche/schulische Ausbildung",10460,1035,"9,9",9.8948374760994255]
["BAIIWeiblich15 bis unter 25 JahreInsgesamtAkademische Ausbildung",4213,312,"7,4",7.4056491811060994]
["BAIIWeiblich15 bis unter 25 JahreDeutscheInsgesamt",82911,10294,"12,4",12.415722883573952]
["BAIIWeiblich15 bis unter 25 JahreDeutscheKeine Berufsausbildung",74871,9491,"12,7",12.676470195402759]
["BAIIWeiblich15 bis unter 25 JahreDeutscheBetriebliche/schulische Ausbildung",7140,752,"10,5",10.532212885154062]
["BAIIWeiblich15 bis unter 25 JahreDeutscheAkademische Ausbildung",900,51,"5,7",5.6666666666666661]
["BAIIWeiblich15 bis unter 25 JahreAusländerInsgesamt",92164,7360,"8,0",7.9857645067488399]
["BAIIWeiblich15 bis unter 25 JahreAusländerKeine Berufsausbildung",85531,6816,"8,0",7.9690404648606936]
["BAIIWeiblich15 bis unter 25 JahreAusländerBetriebliche/schulische Ausbildung",3320,283,"8,5",8.524096385542169]
["BAIIWeiblich15 bis unter 25 JahreAusländerAkademische Ausbildung",3313,261,"7,9",7.8780561424690614]
["BAIIWeiblich25 bis unter 35 JahreInsgesamtInsgesamt",287144,54510,"19,0",18.983506533307327]
["BAIIWeiblich25 bis unter 35 JahreInsgesamtKeine Berufsausbildung",216382,42342,"19,6",19.568171104805391]
["BAIIWeiblich25 bis unter 35 JahreInsgesamtBetriebliche/schulische Ausbildung",43720,8954,"20,5",20.480329368709974]
["BAIIWeiblich25 bis unter 35 JahreInsgesamtAkademische Ausbildung",27042,3214,"11,9",11.885215590562828]
["BAIIWeiblich25 bis unter 35 JahreDeutscheInsgesamt",114840,25391,"22,1",22.109892023685127]
["BAIIWeiblich25 bis unter 35 JahreDeutscheKeine Berufsausbildung",73161,17845,"24,4",24.391410724292996]
["BAIIWeiblich25 bis unter 35 JahreDeutscheBetriebliche/schulische Ausbildung",32672,6717,"20,6",20.558888344760039]
["BAIIWeiblich25 bis unter 35 JahreDeutscheAkademische Ausbildung",9007,829,"9,2",9.2039524814033538]
["BAIIWeiblich25 bis unter 35 JahreAusländerInsgesamt",172304,29119,"16,9",16.899781781038165]
["BAIIWeiblich25 bis unter 35 JahreAusländerKeine Berufsausbildung",143221,24497,"17,1",17.104335258097624]
["BAIIWeiblich25 bis unter 35 JahreAusländerBetriebliche/schulische Ausbildung",11048,2237,"20,2",20.24800868935554]
["BAIIWeiblich25 bis unter 35 JahreAusländerAkademische Ausbildung",18035,2385,"13,2",13.224286110341005]
["BAIIWeiblich35 bis unter 45 JahreInsgesamtInsgesamt",317130,62124,"19,6",19.589442815249267]
["BAIIWeiblich35 bis unter 45 JahreInsgesamtKeine Berufsausbildung",229792,45118,"19,6",19.634277955716474]
["BAIIWeiblich35 bis unter 45 JahreInsgesamtBetriebliche/schulische Ausbildung",57251,12467,"21,8",21.776038846483033]
["BAIIWeiblich35 bis unter 45 JahreInsgesamtAkademische Ausbildung",30087,4539,"15,1",15.086249875361451]
["BAIIWeiblich35 bis unter 45 JahreDeutscheInsgesamt",104703,24208,"23,1",23.120636466958921]
["BAIIWeiblich35 bis unter 45 JahreDeutscheKeine Berufsausbildung",57609,14114,"24,5",24.499644152823343]
["BAIIWeiblich35 bis unter 45 JahreDeutscheBetriebliche/schulische Ausbildung",41287,9144,"22,1",22.147407174171047]
["BAIIWeiblich35 bis unter 45 JahreDeutscheAkademische Ausbildung",5807,950,"16,4",16.359566040985019]
["BAIIWeiblich35 bis unter 45 JahreAusländerInsgesamt",212425,37916,"17,8",17.849123219959985]
["BAIIWeiblich35 bis unter 45 JahreAusländerKeine Berufsausbildung",172181,31004,"18,0",18.006632555276134]
["BAIIWeiblich35 bis unter 45 JahreAusländerBetriebliche/schulische Ausbildung",15964,3323,"20,8",20.815585066399397]
["BAIIWeiblich35 bis unter 45 JahreAusländerAkademische Ausbildung",24280,3589,"14,8",14.78171334431631]
["BAIIWeiblich45 bis unter 55 JahreInsgesamtInsgesamt",223974,43328,"19,3",19.345102556546742]
["BAIIWeiblich45 bis unter 55 JahreInsgesamtKeine Berufsausbildung",159092,31011,"19,5",19.492494908606343]
["BAIIWeiblich45 bis unter 55 JahreInsgesamtBetriebliche/schulische Ausbildung",50820,9965,"19,6",19.608421881149155]
["BAIIWeiblich45 bis unter 55 JahreInsgesamtAkademische Ausbildung",14062,2352,"16,7",16.725928032996727]
["BAIIWeiblich45 bis unter 55 JahreDeutscheInsgesamt",88325,17267,"19,5",19.549391452023777]
["BAIIWeiblich45 bis unter 55 JahreDeutscheKeine Berufsausbildung",46956,9412,"20,0",20.044296788482836]
["BAIIWeiblich45 bis unter 55 JahreDeutscheBetriebliche/schulische Ausbildung",38086,7223,"19,0",18.964974006196503]
["BAIIWeiblich45 bis unter 55 JahreDeutscheAkademische Ausbildung",3283,632,"19,3",19.250685348766371]
["BAIIWeiblich45 bis unter 55 JahreAusländerInsgesamt",135643,26060,"19,2",19.212196722278332]
["BAIIWeiblich45 bis unter 55 JahreAusländerKeine Berufsausbildung",112131,21598,"19,3",19.261399612952708]
["BAIIWeiblich45 bis unter 55 JahreAusländerBetriebliche/schulische Ausbildung",12734,2742,"21,5",21.532904036437884]
["BAIIWeiblich45 bis unter 55 JahreAusländerAkademische Ausbildung",10778,1720,"16,0",15.958433846724809]
["BAIIWeiblich55 und älterInsgesamtInsgesamt",163099,34359,"21,1",21.06634620690501]
["BAIIWeiblich55 und älterInsgesamtKeine Berufsausbildung",107266,22008,"20,5",20.517218876438015]
["BAIIWeiblich55 und älterInsgesamtBetriebliche/schulische Ausbildung",48097,10528,"21,9",21.88909911221074]
["BAIIWeiblich55 und älterInsgesamtAkademische Ausbildung",7736,1823,"23,6",23.565149948293694]
["BAIIWeiblich55 und älterDeutscheInsgesamt",88091,18051,"20,5",20.491310122486976]
["BAIIWeiblich55 und älterDeutscheKeine Berufsausbildung",43486,8686,"20,0",19.974244584463964]
["BAIIWeiblich55 und älterDeutscheBetriebliche/schulische Ausbildung",41602,8626,"20,7",20.734580068265949]
["BAIIWeiblich55 und älterDeutscheAkademische Ausbildung",3003,739,"24,6",24.608724608724607]
["BAIIWeiblich55 und älterAusländerInsgesamt",75008,16308,"21,7",21.741680887372013]
["BAIIWeiblich55 und älterAusländerKeine Berufsausbildung",63780,13322,"20,9",20.887425525243021]
["BAIIWeiblich55 und älterAusländerBetriebliche/schulische Ausbildung",6495,1902,"29,3",29.284064665127019]
["BAIIWeiblich55 und älterAusländerAkademische Ausbildung",4733,1084,"22,9",22.903021339530952]
["SDInsgesamtInsgesamtInsgesamtInsgesamtInsgesamt",1102660,119237,"10,8",10.813578074837212]
["SDInsgesamtInsgesamtInsgesamtInsgesamtKeine Berufsausbildung",545029,64089,"11,8",11.758823842401046]
["SDInsgesamtInsgesamtInsgesamtInsgesamtBetriebliche/schulische Ausbildung",419607,43385,"10,3",10.339436663354043]
["SDInsgesamtInsgesamtInsgesamtInsgesamtAkademische Ausbildung",138024,11763,"8,5",8.5224308815858123]
["SDInsgesamtInsgesamtInsgesamtDeutscheInsgesamt",636453,71106,"11,2",11.172231099547021]
["SDInsgesamtInsgesamtInsgesamtDeutscheKeine Berufsausbildung",207442,27072,"13,1",13.050394809151475]
["SDInsgesamtInsgesamtInsgesamtDeutscheBetriebliche/schulische Ausbildung",341589,36406,"10,7",10.657837342537377]
["SDInsgesamtInsgesamtInsgesamtDeutscheAkademische Ausbildung",87422,7628,"8,7",8.7254924389741717]
["SDInsgesamtInsgesamtInsgesamtAusländerInsgesamt",466205,48131,"10,3",10.323999099108763]
["SDInsgesamtInsgesamtInsgesamtAusländerKeine Berufsausbildung",337585,37017,"11,0",10.96523838440689]
["SDInsgesamtInsgesamtInsgesamtAusländerBetriebliche/schulische Ausbildung",78018,6979,"8,9",8.9453715809172252]
["SDInsgesamtInsgesamtInsgesamtAusländerAkademische Ausbildung",50602,4135,"8,2",8.1716137702067115]
["SDInsgesamtInsgesamt15 bis unter 25 JahreInsgesamtInsgesamt",177120,6532,"3,7",3.687895212285456]
["SDInsgesamtInsgesamt15 bis unter 25 JahreInsgesamtKeine Berufsausbildung",107429,5317,"4,9",4.9493153617738228]
["SDInsgesamtInsgesamt15 bis unter 25 JahreInsgesamtBetriebliche/schulische Ausbildung",65483,1098,"1,7",1.6767710703541376]
["SDInsgesamtInsgesamt15 bis unter 25 JahreInsgesamtAkademische Ausbildung",4208,117,"2,8",2.7804182509505702]
["SDInsgesamtInsgesamt15 bis unter 25 JahreDeutscheInsgesamt",111589,3566,"3,2",3.1956554857557649]
["SDInsgesamtInsgesamt15 bis unter 25 JahreDeutscheKeine Berufsausbildung",52987,2672,"5,0",5.0427463340064547]
["SDInsgesamtInsgesamt15 bis unter 25 JahreDeutscheBetriebliche/schulische Ausbildung",56027,865,"1,5",1.5438984775197673]
["SDInsgesamtInsgesamt15 bis unter 25 JahreDeutscheAkademische Ausbildung",2575,29,"1,1",1.1262135922330097]
["SDInsgesamtInsgesamt15 bis unter 25 JahreAusländerInsgesamt",65530,2966,"4,5",4.5261712192888757]
["SDInsgesamtInsgesamt15 bis unter 25 JahreAusländerKeine Berufsausbildung",54441,2645,"4,9",4.8584706379383187]
["SDInsgesamtInsgesamt15 bis unter 25 JahreAusländerBetriebliche/schulische Ausbildung",9456,233,"2,5",2.4640439932318103]
["SDInsgesamtInsgesamt15 bis unter 25 JahreAusländerAkademische Ausbildung",1633,88,"5,4",5.388854868340478]
["SDInsgesamtInsgesamt25 bis unter 35 JahreInsgesamtInsgesamt",287777,22826,"7,9",7.9318361092095611]
["SDInsgesamtInsgesamt25 bis unter 35 JahreInsgesamtKeine Berufsausbildung",132807,14406,"10,8",10.84731979489033]
["SDInsgesamtInsgesamt25 bis unter 35 JahreInsgesamtBetriebliche/schulische Ausbildung",102573,6313,"6,2",6.1546410848858857]
["SDInsgesamtInsgesamt25 bis unter 35 JahreInsgesamtAkademische Ausbildung",52397,2107,"4,0",4.0212225890795272]
["SDInsgesamtInsgesamt25 bis unter 35 JahreDeutscheInsgesamt",159930,11552,"7,2",7.2231601325579948]
["SDInsgesamtInsgesamt25 bis unter 35 JahreDeutscheKeine Berufsausbildung",45347,5705,"12,6",12.580766092575033]
["SDInsgesamtInsgesamt25 bis unter 35 JahreDeutscheBetriebliche/schulische Ausbildung",80320,4802,"6,0",5.9785856573705178]
["SDInsgesamtInsgesamt25 bis unter 35 JahreDeutscheAkademische Ausbildung",34263,1045,"3,0",3.0499372500948545]
["SDInsgesamtInsgesamt25 bis unter 35 JahreAusländerInsgesamt",127847,11274,"8,8",8.8183531877947861]
["SDInsgesamtInsgesamt25 bis unter 35 JahreAusländerKeine Berufsausbildung",87460,8701,"9,9",9.9485479076149108]
["SDInsgesamtInsgesamt25 bis unter 35 JahreAusländerBetriebliche/schulische Ausbildung",22253,1511,"6,8",6.7900957174313579]
["SDInsgesamtInsgesamt25 bis unter 35 JahreAusländerAkademische Ausbildung",18134,1062,"5,9",5.8564023381493326]
["SDInsgesamtInsgesamt35 bis unter 45 JahreInsgesamtInsgesamt",247550,25457,"10,3",10.283579074934357]
["SDInsgesamtInsgesamt35 bis unter 45 JahreInsgesamtKeine Berufsausbildung",124344,15222,"12,2",12.241845203628642]
["SDInsgesamtInsgesamt35 bis unter 45 JahreInsgesamtBetriebliche/schulische Ausbildung",82611,7353,"8,9",8.9007517158731879]
["SDInsgesamtInsgesamt35 bis unter 45 JahreInsgesamtAkademische Ausbildung",40595,2882,"7,1",7.0993964773986953]
["SDInsgesamtInsgesamt35 bis unter 45 JahreDeutscheInsgesamt",118978,11758,"9,9",9.8824992855822078]
["SDInsgesamtInsgesamt35 bis unter 45 JahreDeutscheKeine Berufsausbildung",34891,4942,"14,2",14.164111088819467]
["SDInsgesamtInsgesamt35 bis unter 45 JahreDeutscheBetriebliche/schulische Ausbildung",62466,5456,"8,7",8.7343514872090413]
["SDInsgesamtInsgesamt35 bis unter 45 JahreDeutscheAkademische Ausbildung",21621,1360,"6,3",6.2901808426992281]
["SDInsgesamtInsgesamt35 bis unter 45 JahreAusländerInsgesamt",128571,13699,"10,7",10.654813293822091]
["SDInsgesamtInsgesamt35 bis unter 45 JahreAusländerKeine Berufsausbildung",89452,10280,"11,5",11.492196932433037]
["SDInsgesamtInsgesamt35 bis unter 45 JahreAusländerBetriebliche/schulische Ausbildung",20145,1897,"9,4",9.4167287168031777]
["SDInsgesamtInsgesamt35 bis unter 45 JahreAusländerAkademische Ausbildung",18974,1522,"8,0",8.0215031095182887]
["SDInsgesamtInsgesamt45 bis unter 55 JahreInsgesamtInsgesamt",201007,22313,"11,1",11.10060843652211]
["SDInsgesamtInsgesamt45 bis unter 55 JahreInsgesamtKeine Berufsausbildung",98425,12451,"12,7",12.650241300482602]
["SDInsgesamtInsgesamt45 bis unter 55 JahreInsgesamtBetriebliche/schulische Ausbildung",80958,7903,"9,8",9.7618518244027772]
["SDInsgesamtInsgesamt45 bis unter 55 JahreInsgesamtAkademische Ausbildung",21624,1959,"9,1",9.0593784683684806]
["SDInsgesamtInsgesamt45 bis unter 55 JahreDeutscheInsgesamt",110184,11626,"10,6",10.551441225586291]
["SDInsgesamtInsgesamt45 bis unter 55 JahreDeutscheKeine Berufsausbildung",32935,4319,"13,1",13.113708820403824]
["SDInsgesamtInsgesamt45 bis unter 55 JahreDeutscheBetriebliche/schulische Ausbildung",63809,6163,"9,7",9.6585121221144341]
["SDInsgesamtInsgesamt45 bis unter 55 JahreDeutscheAkademische Ausbildung",13440,1144,"8,5",8.5119047619047628]
["SDInsgesamtInsgesamt45 bis unter 55 JahreAusländerInsgesamt",90823,10687,"11,8",11.766843200510884]
["SDInsgesamtInsgesamt45 bis unter 55 JahreAusländerKeine Berufsausbildung",65490,8132,"12,4",12.417162925637502]
["SDInsgesamtInsgesamt45 bis unter 55 JahreAusländerBetriebliche/schulische Ausbildung",17149,1740,"10,1",10.146364219488017]
["SDInsgesamtInsgesamt45 bis unter 55 JahreAusländerAkademische Ausbildung",8184,815,"10,0",9.9584555229716507]
["SDInsgesamtInsgesamt55 und älterInsgesamtInsgesamt",189206,42109,"22,3",22.255636713423467]
["SDInsgesamtInsgesamt55 und älterInsgesamtKeine Berufsausbildung",82024,16693,"20,4",20.351360577391983]
["SDInsgesamtInsgesamt55 und älterInsgesamtBetriebliche/schulische Ausbildung",87982,20718,"23,5",23.547998454229273]
["SDInsgesamtInsgesamt55 und älterInsgesamtAkademische Ausbildung",19200,4698,"24,5",24.46875]
["SDInsgesamtInsgesamt55 und älterDeutscheInsgesamt",135772,32604,"24,0",24.013787820758331]
["SDInsgesamtInsgesamt55 und älterDeutscheKeine Berufsausbildung",41282,9434,"22,9",22.852574972142822]
["SDInsgesamtInsgesamt55 und älterDeutscheBetriebliche/schulische Ausbildung",78967,19120,"24,2",24.212645788747196]
["SDInsgesamtInsgesamt55 und älterDeutscheAkademische Ausbildung",15523,4050,"26,1",26.090317593248731]
["SDInsgesamtInsgesamt55 und älterAusländerInsgesamt",53434,9505,"17,8",17.788299584534194]
["SDInsgesamtInsgesamt55 und älterAusländerKeine Berufsausbildung",40742,7259,"17,8",17.816994747435082]
["SDInsgesamtInsgesamt55 und älterAusländerBetriebliche/schulische Ausbildung",9015,1598,"17,7",17.726012201885748]
["SDInsgesamtInsgesamt55 und älterAusländerAkademische Ausbildung",3677,648,"17,6",17.623062279031821]
["SDInsgesamtMännlichInsgesamtInsgesamtInsgesamt",578249,62094,"10,7",10.738280567713909]
["SDInsgesamtMännlichInsgesamtInsgesamtKeine Berufsausbildung",284877,31371,"11,0",11.012121020651017]
["SDInsgesamtMännlichInsgesamtInsgesamtBetriebliche/schulische Ausbildung",232374,24432,"10,5",10.514085052544605]
["SDInsgesamtMännlichInsgesamtInsgesamtAkademische Ausbildung",60998,6291,"10,3",10.313452900095085]
["SDInsgesamtMännlichInsgesamtDeutscheInsgesamt",347540,40365,"11,6",11.614490418369108]
["SDInsgesamtMännlichInsgesamtDeutscheKeine Berufsausbildung",115686,14619,"12,6",12.636792697474197]
["SDInsgesamtMännlichInsgesamtDeutscheBetriebliche/schulische Ausbildung",189296,21029,"11,1",11.109056715408672]
["SDInsgesamtMännlichInsgesamtDeutscheAkademische Ausbildung",42558,4717,"11,1",11.083697542177735]
["SDInsgesamtMännlichInsgesamtAusländerInsgesamt",230707,21729,"9,4",9.4184398392766582]
["SDInsgesamtMännlichInsgesamtAusländerKeine Berufsausbildung",169189,16752,"9,9",9.901352924835539]
["SDInsgesamtMännlichInsgesamtAusländerBetriebliche/schulische Ausbildung",43078,3403,"7,9",7.8996239379729802]
["SDInsgesamtMännlichInsgesamtAusländerAkademische Ausbildung",18440,1574,"8,5",8.5357917570498909]
["SDInsgesamtMännlich15 bis unter 25 JahreInsgesamtInsgesamt",101256,3749,"3,7",3.7024966421742911]
["SDInsgesamtMännlich15 bis unter 25 JahreInsgesamtKeine Berufsausbildung",62109,3069,"4,9",4.9413128532096797]
["SDInsgesamtMännlich15 bis unter 25 JahreInsgesamtBetriebliche/schulische Ausbildung",37709,642,"1,7",1.7025113368161446]
["SDInsgesamtMännlich15 bis unter 25 JahreInsgesamtAkademische Ausbildung",1438,38,"2,6",2.642559109874826]
["SDInsgesamtMännlich15 bis unter 25 JahreDeutscheInsgesamt",64266,2070,"3,2",3.2209877695826719]
["SDInsgesamtMännlich15 bis unter 25 JahreDeutscheKeine Berufsausbildung",30898,1533,"5,0",4.9614861803352968]
["SDInsgesamtMännlich15 bis unter 25 JahreDeutscheBetriebliche/schulische Ausbildung",32338,519,"1,6",1.6049230008040076]
["SDInsgesamtMännlich15 bis unter 25 JahreDeutscheAkademische Ausbildung",1030,18,"1,7",1.7475728155339807]
["SDInsgesamtMännlich15 bis unter 25 JahreAusländerInsgesamt",36989,1679,"4,5",4.5391873259617723]
["SDInsgesamtMännlich15 bis unter 25 JahreAusländerKeine Berufsausbildung",31210,1536,"4,9",4.9214995193848123]
["SDInsgesamtMännlich15 bis unter 25 JahreAusländerBetriebliche/schulische Ausbildung",5371,123,"2,3",2.2900763358778624]
["SDInsgesamtMännlich15 bis unter 25 JahreAusländerAkademische Ausbildung",408,20,"4,9",4.9019607843137258]
["SDInsgesamtMännlich25 bis unter 35 JahreInsgesamtInsgesamt",156372,11706,"7,5",7.4859949351546318]
["SDInsgesamtMännlich25 bis unter 35 JahreInsgesamtKeine Berufsausbildung",75273,7391,"9,8",9.8189257768389737]
["SDInsgesamtMännlich25 bis unter 35 JahreInsgesamtBetriebliche/schulische Ausbildung",59323,3384,"5,7",5.7043642432108967]
["SDInsgesamtMännlich25 bis unter 35 JahreInsgesamtAkademische Ausbildung",21776,931,"4,3",4.2753490080822925]
["SDInsgesamtMännlich25 bis unter 35 JahreDeutscheInsgesamt",88428,6465,"7,3",7.3110327045732113]
["SDInsgesamtMännlich25 bis unter 35 JahreDeutscheKeine Berufsausbildung",26989,3239,"12,0",12.001185668235207]
["SDInsgesamtMännlich25 bis unter 35 JahreDeutscheBetriebliche/schulische Ausbildung",46444,2682,"5,8",5.7746964085780732]
["SDInsgesamtMännlich25 bis unter 35 JahreDeutscheAkademische Ausbildung",14995,544,"3,6",3.6278759586528841]
["SDInsgesamtMännlich25 bis unter 35 JahreAusländerInsgesamt",67944,5241,"7,7",7.7137054044507245]
["SDInsgesamtMännlich25 bis unter 35 JahreAusländerKeine Berufsausbildung",48284,4152,"8,6",8.5991218623146395]
["SDInsgesamtMännlich25 bis unter 35 JahreAusländerBetriebliche/schulische Ausbildung",12879,702,"5,5",5.450733752620545]
["SDInsgesamtMännlich25 bis unter 35 JahreAusländerAkademische Ausbildung",6781,387,"5,7",5.7071228432384604]
["SDInsgesamtMännlich35 bis unter 45 JahreInsgesamtInsgesamt",120628,11937,"9,9",9.8957124382398778]
["SDInsgesamtMännlich35 bis unter 45 JahreInsgesamtKeine Berufsausbildung",60060,6905,"11,5",11.496836496836497]
["SDInsgesamtMännlich35 bis unter 45 JahreInsgesamtBetriebliche/schulische Ausbildung",44225,3869,"8,7",8.7484454494064448]
["SDInsgesamtMännlich35 bis unter 45 JahreInsgesamtAkademische Ausbildung",16343,1163,"7,1",7.1161965367435602]
["SDInsgesamtMännlich35 bis unter 45 JahreDeutscheInsgesamt",62911,6339,"10,1",10.076139307911177]
["SDInsgesamtMännlich35 bis unter 45 JahreDeutscheKeine Berufsausbildung",19454,2707,"13,9",13.914876118022001]
["SDInsgesamtMännlich35 bis unter 45 JahreDeutscheBetriebliche/schulische Ausbildung",33682,2988,"8,9",8.8712071729707258]
["SDInsgesamtMännlich35 bis unter 45 JahreDeutscheAkademische Ausbildung",9775,644,"6,6",6.5882352941176476]
["SDInsgesamtMännlich35 bis unter 45 JahreAusländerInsgesamt",57716,5598,"9,7",9.699216854944904]
["SDInsgesamtMännlich35 bis unter 45 JahreAusländerKeine Berufsausbildung",40605,4198,"10,3",10.338628247752741]
["SDInsgesamtMännlich35 bis unter 45 JahreAusländerBetriebliche/schulische Ausbildung",10543,881,"8,4",8.3562553352935591]
["SDInsgesamtMännlich35 bis unter 45 JahreAusländerAkademische Ausbildung",6568,519,"7,9",7.9019488428745426]
["SDInsgesamtMännlich45 bis unter 55 JahreInsgesamtInsgesamt",99368,11329,"11,4",11.401054665485871]
["SDInsgesamtMännlich45 bis unter 55 JahreInsgesamtKeine Berufsausbildung",47321,5917,"12,5",12.503962300035926]
["SDInsgesamtMännlich45 bis unter 55 JahreInsgesamtBetriebliche/schulische Ausbildung",42095,4414,"10,5",10.485805915191829]
["SDInsgesamtMännlich45 bis unter 55 JahreInsgesamtAkademische Ausbildung",9952,998,"10,0",10.02813504823151]
["SDInsgesamtMännlich45 bis unter 55 JahreDeutscheInsgesamt",57173,6594,"11,5",11.533416122995121]
["SDInsgesamtMännlich45 bis unter 55 JahreDeutscheKeine Berufsausbildung",17213,2409,"14,0",13.995236158717248]
["SDInsgesamtMännlich45 bis unter 55 JahreDeutscheBetriebliche/schulische Ausbildung",33029,3535,"10,7",10.70271579521027]
["SDInsgesamtMännlich45 bis unter 55 JahreDeutscheAkademische Ausbildung",6931,650,"9,4",9.3781561102294049]
["SDInsgesamtMännlich45 bis unter 55 JahreAusländerInsgesamt",42195,4735,"11,2",11.221708733262235]
["SDInsgesamtMännlich45 bis unter 55 JahreAusländerKeine Berufsausbildung",30108,3508,"11,7",11.651388335326159]
["SDInsgesamtMännlich45 bis unter 55 JahreAusländerBetriebliche/schulische Ausbildung",9066,879,"9,7",9.695565850430178]
["SDInsgesamtMännlich45 bis unter 55 JahreAusländerAkademische Ausbildung",3021,348,"11,5",11.519364448857994]
["SDInsgesamtMännlich55 und älterInsgesamtInsgesamt",100625,23373,"23,2",23.227826086956522]
["SDInsgesamtMännlich55 und älterInsgesamtKeine Berufsausbildung",40114,8089,"20,2",20.165029665453456]
["SDInsgesamtMännlich55 und älterInsgesamtBetriebliche/schulische Ausbildung",49022,12123,"24,7",24.729713189996328]
["SDInsgesamtMännlich55 und älterInsgesamtAkademische Ausbildung",11489,3161,"27,5",27.51327356601967]
["SDInsgesamtMännlich55 und älterDeutscheInsgesamt",74762,18897,"25,3",25.276209839223135]
["SDInsgesamtMännlich55 und älterDeutscheKeine Berufsausbildung",21132,4731,"22,4",22.387847813742194]
["SDInsgesamtMännlich55 und älterDeutscheBetriebliche/schulische Ausbildung",43803,11305,"25,8",25.80873456155971]
["SDInsgesamtMännlich55 und älterDeutscheAkademische Ausbildung",9827,2861,"29,1",29.113666429225603]
["SDInsgesamtMännlich55 und älterAusländerInsgesamt",25863,4476,"17,3",17.306576963229322]
["SDInsgesamtMännlich55 und älterAusländerKeine Berufsausbildung",18982,3358,"17,7",17.690443578126647]
["SDInsgesamtMännlich55 und älterAusländerBetriebliche/schulische Ausbildung",5219,818,"15,7",15.673500670626556]
["SDInsgesamtMännlich55 und älterAusländerAkademische Ausbildung",1662,300,"18,1",18.050541516245488]
["SDInsgesamtWeiblichInsgesamtInsgesamtInsgesamt",524400,57143,"10,9",10.896834477498093]
["SDInsgesamtWeiblichInsgesamtInsgesamtKeine Berufsausbildung",260145,32718,"12,6",12.576832151300236]
["SDInsgesamtWeiblichInsgesamtInsgesamtBetriebliche/schulische Ausbildung",187232,18953,"10,1",10.122735429841052]
["SDInsgesamtWeiblichInsgesamtInsgesamtAkademische Ausbildung",77023,5472,"7,1",7.1043714215234406]
["SDInsgesamtWeiblichInsgesamtDeutscheInsgesamt",288907,30741,"10,6",10.640448310355929]
["SDInsgesamtWeiblichInsgesamtDeutscheKeine Berufsausbildung",91753,12453,"13,6",13.57230826240014]
["SDInsgesamtWeiblichInsgesamtDeutscheBetriebliche/schulische Ausbildung",152292,15377,"10,1",10.097050403172853]
["SDInsgesamtWeiblichInsgesamtDeutscheAkademische Ausbildung",44862,2911,"6,5",6.4887878382595519]
["SDInsgesamtWeiblichInsgesamtAusländerInsgesamt",235493,26402,"11,2",11.21137358647603]
["SDInsgesamtWeiblichInsgesamtAusländerKeine Berufsausbildung",168392,20265,"12,0",12.034419687396076]
["SDInsgesamtWeiblichInsgesamtAusländerBetriebliche/schulische Ausbildung",34940,3576,"10,2",10.23468803663423]
["SDInsgesamtWeiblichInsgesamtAusländerAkademische Ausbildung",32161,2561,"8,0",7.9630608500979445]
["SDInsgesamtWeiblich15 bis unter 25 JahreInsgesamtInsgesamt",75863,2783,"3,7",3.6684549780525417]
["SDInsgesamtWeiblich15 bis unter 25 JahreInsgesamtKeine Berufsausbildung",45320,2248,"5,0",4.9602824360105915]
["SDInsgesamtWeiblich15 bis unter 25 JahreInsgesamtBetriebliche/schulische Ausbildung",27773,456,"1,6",1.6418824037734492]
["SDInsgesamtWeiblich15 bis unter 25 JahreInsgesamtAkademische Ausbildung",2770,79,"2,9",2.8519855595667871]
["SDInsgesamtWeiblich15 bis unter 25 JahreDeutscheInsgesamt",47322,1496,"3,2",3.1613203161320316]
["SDInsgesamtWeiblich15 bis unter 25 JahreDeutscheKeine Berufsausbildung",22089,1139,"5,2",5.1564126941011361]
["SDInsgesamtWeiblich15 bis unter 25 JahreDeutscheBetriebliche/schulische Ausbildung",23688,346,"1,5",1.4606551840594393]
["SDInsgesamtWeiblich15 bis unter 25 JahreDeutscheAkademische Ausbildung",1545,11,"0,7",0.71197411003236255]
["SDInsgesamtWeiblich15 bis unter 25 JahreAusländerInsgesamt",28541,1287,"4,5",4.5093024070635233]
["SDInsgesamtWeiblich15 bis unter 25 JahreAusländerKeine Berufsausbildung",23231,1109,"4,8",4.7737936378115453]
["SDInsgesamtWeiblich15 bis unter 25 JahreAusländerBetriebliche/schulische Ausbildung",4085,110,"2,7",2.6927784577723379]
["SDInsgesamtWeiblich15 bis unter 25 JahreAusländerAkademische Ausbildung",1225,68,"5,6",5.5510204081632653]
["SDInsgesamtWeiblich25 bis unter 35 JahreInsgesamtInsgesamt",131401,11120,"8,5",8.4626448809369794]
["SDInsgesamtWeiblich25 bis unter 35 JahreInsgesamtKeine Berufsausbildung",57532,7015,"12,2",12.193214211221582]
["SDInsgesamtWeiblich25 bis unter 35 JahreInsgesamtBetriebliche/schulische Ausbildung",43250,2929,"6,8",6.772254335260115]
["SDInsgesamtWeiblich25 bis unter 35 JahreInsgesamtAkademische Ausbildung",30619,1176,"3,8",3.840752473954081]
["SDInsgesamtWeiblich25 bis unter 35 JahreDeutscheInsgesamt",71500,5087,"7,1",7.1146853146853148]
["SDInsgesamtWeiblich25 bis unter 35 JahreDeutscheKeine Berufsausbildung",18358,2466,"13,4",13.432835820895523]
["SDInsgesamtWeiblich25 bis unter 35 JahreDeutscheBetriebliche/schulische Ausbildung",33876,2120,"6,3",6.2581178415397325]
["SDInsgesamtWeiblich25 bis unter 35 JahreDeutscheAkademische Ausbildung",19266,501,"2,6",2.6004360012457179]
["SDInsgesamtWeiblich25 bis unter 35 JahreAusländerInsgesamt",59901,6033,"10,1",10.071618169980468]
["SDInsgesamtWeiblich25 bis unter 35 JahreAusländerKeine Berufsausbildung",39174,4549,"11,6",11.612293868382089]
["SDInsgesamtWeiblich25 bis unter 35 JahreAusländerBetriebliche/schulische Ausbildung",9374,809,"8,6",8.6302538937486677]
["SDInsgesamtWeiblich25 bis unter 35 JahreAusländerAkademische Ausbildung",11353,675,"5,9",5.945565048885757]
["SDInsgesamtWeiblich35 bis unter 45 JahreInsgesamtInsgesamt",126920,13520,"10,7",10.652379451623069]
["SDInsgesamtWeiblich35 bis unter 45 JahreInsgesamtKeine Berufsausbildung",64283,8317,"12,9",12.938101830966197]
["SDInsgesamtWeiblich35 bis unter 45 JahreInsgesamtBetriebliche/schulische Ausbildung",38386,3484,"9,1",9.076225707289117]
["SDInsgesamtWeiblich35 bis unter 45 JahreInsgesamtAkademische Ausbildung",24251,1719,"7,1",7.0883674900004117]
["SDInsgesamtWeiblich35 bis unter 45 JahreDeutscheInsgesamt",56066,5419,"9,7",9.66539435665109]
["SDInsgesamtWeiblich35 bis unter 45 JahreDeutscheKeine Berufsausbildung",15436,2235,"14,5",14.47913967349054]
["SDInsgesamtWeiblich35 bis unter 45 JahreDeutscheBetriebliche/schulische Ausbildung",28784,2468,"8,6",8.5742078932740409]
["SDInsgesamtWeiblich35 bis unter 45 JahreDeutscheAkademische Ausbildung",11846,716,"6,0",6.0442343407057235]
["SDInsgesamtWeiblich35 bis unter 45 JahreAusländerInsgesamt",70854,8101,"11,4",11.43337002850933]
["SDInsgesamtWeiblich35 bis unter 45 JahreAusländerKeine Berufsausbildung",48847,6082,"12,5",12.451122893934121]
["SDInsgesamtWeiblich35 bis unter 45 JahreAusländerBetriebliche/schulische Ausbildung",9602,1016,"10,6",10.581128931472609]
["SDInsgesamtWeiblich35 bis unter 45 JahreAusländerAkademische Ausbildung",12405,1003,"8,1",8.0854494155582426]
["SDInsgesamtWeiblich45 bis unter 55 JahreInsgesamtInsgesamt",101638,10984,"10,8",10.806981640724926]
["SDInsgesamtWeiblich45 bis unter 55 JahreInsgesamtKeine Berufsausbildung",51103,6534,"12,8",12.785942116901161]
["SDInsgesamtWeiblich45 bis unter 55 JahreInsgesamtBetriebliche/schulische Ausbildung",38863,3489,"9,0",8.9776908627743612]
["SDInsgesamtWeiblich45 bis unter 55 JahreInsgesamtAkademische Ausbildung",11672,961,"8,2",8.2333790267306384]
["SDInsgesamtWeiblich45 bis unter 55 JahreDeutscheInsgesamt",53010,5032,"9,5",9.4925485757404271]
["SDInsgesamtWeiblich45 bis unter 55 JahreDeutscheKeine Berufsausbildung",15721,1910,"12,1",12.149354366770563]
["SDInsgesamtWeiblich45 bis unter 55 JahreDeutscheBetriebliche/schulische Ausbildung",30780,2628,"8,5",8.5380116959064338]
["SDInsgesamtWeiblich45 bis unter 55 JahreDeutscheAkademische Ausbildung",6509,494,"7,6",7.5894914733445988]
["SDInsgesamtWeiblich45 bis unter 55 JahreAusländerInsgesamt",48628,5952,"12,2",12.239861808011845]
["SDInsgesamtWeiblich45 bis unter 55 JahreAusländerKeine Berufsausbildung",35382,4624,"13,1",13.068792041150868]
["SDInsgesamtWeiblich45 bis unter 55 JahreAusländerBetriebliche/schulische Ausbildung",8083,861,"10,7",10.651985648892738]
["SDInsgesamtWeiblich45 bis unter 55 JahreAusländerAkademische Ausbildung",5163,467,"9,0",9.0451288010846405]
["SDInsgesamtWeiblich55 und älterInsgesamtInsgesamt",88578,18736,"21,2",21.151979046715887]
["SDInsgesamtWeiblich55 und älterInsgesamtKeine Berufsausbildung",41907,8604,"20,5",20.531176175817883]
["SDInsgesamtWeiblich55 und älterInsgesamtBetriebliche/schulische Ausbildung",38960,8595,"22,1",22.061088295687885]
["SDInsgesamtWeiblich55 und älterInsgesamtAkademische Ausbildung",7711,1537,"19,9",19.932563869796393]
["SDInsgesamtWeiblich55 und älterDeutscheInsgesamt",61009,13707,"22,5",22.467176973889096]
["SDInsgesamtWeiblich55 und älterDeutscheKeine Berufsausbildung",20149,4703,"23,3",23.341108739887837]
["SDInsgesamtWeiblich55 und älterDeutscheBetriebliche/schulische Ausbildung",35164,7815,"22,2",22.224434080309408]
["SDInsgesamtWeiblich55 und älterDeutscheAkademische Ausbildung",5696,1189,"20,9",20.874297752808989]
["SDInsgesamtWeiblich55 und älterAusländerInsgesamt",27569,5029,"18,2",18.241503137582065]
["SDInsgesamtWeiblich55 und älterAusländerKeine Berufsausbildung",21758,3901,"17,9",17.929037595367223]
["SDInsgesamtWeiblich55 und älterAusländerBetriebliche/schulische Ausbildung",3796,780,"20,5",20.547945205479451]
["SDInsgesamtWeiblich55 und älterAusländerAkademische Ausbildung",2015,348,"17,3",17.270471464019852]
["SDIIIInsgesamtInsgesamtInsgesamtInsgesamt",671234,54571,"8,1",8.1299517008971538]
["SDIIIInsgesamtInsgesamtInsgesamtKeine Berufsausbildung",229120,18113,"7,9",7.9054643854748603]
["SDIIIInsgesamtInsgesamtInsgesamtBetriebliche/schulische Ausbildung",336755,28690,"8,5",8.5195468515686468]
["SDIIIInsgesamtInsgesamtInsgesamtAkademische Ausbildung",105359,7768,"7,4",7.3728869863988837]
["SDIIIInsgesamtInsgesamtDeutscheInsgesamt",478036,43306,"9,1",9.0591503568768879]
["SDIIIInsgesamtInsgesamtDeutscheKeine Berufsausbildung",116491,11138,"9,6",9.5612536590809594]
["SDIIIInsgesamtInsgesamtDeutscheBetriebliche/schulische Ausbildung",282797,25725,"9,1",9.0966311523813896]
["SDIIIInsgesamtInsgesamtDeutscheAkademische Ausbildung",78748,6443,"8,2",8.1817950932087165]
["SDIIIInsgesamtInsgesamtAusländerInsgesamt",193198,11265,"5,8",5.8308057019223796]
["SDIIIInsgesamtInsgesamtAusländerKeine Berufsausbildung",112629,6975,"6,2",6.1928988093652615]
["SDIIIInsgesamtInsgesamtAusländerBetriebliche/schulische Ausbildung",53958,2965,"5,5",5.4950146410170877]
["SDIIIInsgesamtInsgesamtAusländerAkademische Ausbildung",26611,1325,"5,0",4.9791439630228096]
["SDIIIInsgesamt15 bis unter 25 JahreInsgesamtInsgesamt",111887,1803,"1,6",1.6114472637571837]
["SDIIIInsgesamt15 bis unter 25 JahreInsgesamtKeine Berufsausbildung",47398,948,"2,0",2.000084391746487]
["SDIIIInsgesamt15 bis unter 25 JahreInsgesamtBetriebliche/schulische Ausbildung",61755,831,"1,3",1.3456400291474375]
["SDIIIInsgesamt15 bis unter 25 JahreInsgesamtAkademische Ausbildung",2734,24,"0,9",0.87783467446964147]
["SDIIIInsgesamt15 bis unter 25 JahreDeutscheInsgesamt",88294,1376,"1,6",1.5584297913788026]
["SDIIIInsgesamt15 bis unter 25 JahreDeutscheKeine Berufsausbildung",32130,660,"2,1",2.0541549953314657]
["SDIIIInsgesamt15 bis unter 25 JahreDeutscheBetriebliche/schulische Ausbildung",53844,699,"1,3",1.2981947849342546]
["SDIIIInsgesamt15 bis unter 25 JahreDeutscheAkademische Ausbildung",2320,17,"0,7",0.73275862068965514]
["SDIIIInsgesamt15 bis unter 25 JahreAusländerInsgesamt",23593,427,"1,8",1.8098588564404696]
["SDIIIInsgesamt15 bis unter 25 JahreAusländerKeine Berufsausbildung",15268,288,"1,9",1.8862981399004455]
["SDIIIInsgesamt15 bis unter 25 JahreAusländerBetriebliche/schulische Ausbildung",7911,132,"1,7",1.6685627607129314]
["SDIIIInsgesamt15 bis unter 25 JahreAusländerAkademische Ausbildung",414,7,"1,7",1.6908212560386473]
["SDIIIInsgesamt25 bis unter 35 JahreInsgesamtInsgesamt",182501,7198,"3,9",3.9440879776001228]
["SDIIIInsgesamt25 bis unter 35 JahreInsgesamtKeine Berufsausbildung",56432,2778,"4,9",4.9227388715622347]
["SDIIIInsgesamt25 bis unter 35 JahreInsgesamtBetriebliche/schulische Ausbildung",84401,3245,"3,8",3.8447411760524166]
["SDIIIInsgesamt25 bis unter 35 JahreInsgesamtAkademische Ausbildung",41668,1175,"2,8",2.8199097628875873]
["SDIIIInsgesamt25 bis unter 35 JahreDeutscheInsgesamt",121445,4663,"3,8",3.8395981720120216]
["SDIIIInsgesamt25 bis unter 35 JahreDeutscheKeine Berufsausbildung",23217,1315,"5,7",5.663953137786967]
["SDIIIInsgesamt25 bis unter 35 JahreDeutscheBetriebliche/schulische Ausbildung",67671,2564,"3,8",3.7889199213843447]
["SDIIIInsgesamt25 bis unter 35 JahreDeutscheAkademische Ausbildung",30557,784,"2,6",2.5656968943286316]
["SDIIIInsgesamt25 bis unter 35 JahreAusländerInsgesamt",61056,2535,"4,2",4.1519261006289314]
["SDIIIInsgesamt25 bis unter 35 JahreAusländerKeine Berufsausbildung",33215,1463,"4,4",4.4046364594309804]
["SDIIIInsgesamt25 bis unter 35 JahreAusländerBetriebliche/schulische Ausbildung",16730,681,"4,1",4.0705319784817693]
["SDIIIInsgesamt25 bis unter 35 JahreAusländerAkademische Ausbildung",11111,391,"3,5",3.5190351903519033]
["SDIIIInsgesamt35 bis unter 45 JahreInsgesamtInsgesamt",134325,7383,"5,5",5.4963707426018988]
["SDIIIInsgesamt35 bis unter 45 JahreInsgesamtKeine Berufsausbildung",44351,2588,"5,8",5.835268652341548]
["SDIIIInsgesamt35 bis unter 45 JahreInsgesamtBetriebliche/schulische Ausbildung",60866,3333,"5,5",5.4759635921532546]
["SDIIIInsgesamt35 bis unter 45 JahreInsgesamtAkademische Ausbildung",29108,1462,"5,0",5.0226741789198845]
["SDIIIInsgesamt35 bis unter 45 JahreDeutscheInsgesamt",85064,4794,"5,6",5.6357566067901814]
["SDIIIInsgesamt35 bis unter 45 JahreDeutscheKeine Berufsausbildung",17507,1156,"6,6",6.6030730564916889]
["SDIIIInsgesamt35 bis unter 45 JahreDeutscheBetriebliche/schulische Ausbildung",48040,2631,"5,5",5.4766860949208986]
["SDIIIInsgesamt35 bis unter 45 JahreDeutscheAkademische Ausbildung",19517,1007,"5,2",5.1596044474048268]
["SDIIIInsgesamt35 bis unter 45 JahreAusländerInsgesamt",49261,2589,"5,3",5.2556789346541892]
["SDIIIInsgesamt35 bis unter 45 JahreAusländerKeine Berufsausbildung",26844,1432,"5,3",5.3345254060497691]
["SDIIIInsgesamt35 bis unter 45 JahreAusländerBetriebliche/schulische Ausbildung",12826,702,"5,5",5.473257445813192]
["SDIIIInsgesamt35 bis unter 45 JahreAusländerAkademische Ausbildung",9591,455,"4,7",4.7440308622667082]
["SDIIIInsgesamt45 bis unter 55 JahreInsgesamtInsgesamt",116655,8282,"7,1",7.0995670995670999]
["SDIIIInsgesamt45 bis unter 55 JahreInsgesamtKeine Berufsausbildung",41085,2960,"7,2",7.2045758792746746]
["SDIIIInsgesamt45 bis unter 55 JahreInsgesamtBetriebliche/schulische Ausbildung",59675,4183,"7,0",7.0096355257645584]
["SDIIIInsgesamt45 bis unter 55 JahreInsgesamtAkademische Ausbildung",15895,1139,"7,2",7.1657754010695189]
["SDIIIInsgesamt45 bis unter 55 JahreDeutscheInsgesamt",78403,5867,"7,5",7.4831320230093246]
["SDIIIInsgesamt45 bis unter 55 JahreDeutscheKeine Berufsausbildung",17530,1448,"8,3",8.2601254991443245]
["SDIIIInsgesamt45 bis unter 55 JahreDeutscheBetriebliche/schulische Ausbildung",48805,3526,"7,2",7.2246696035242293]
["SDIIIInsgesamt45 bis unter 55 JahreDeutscheAkademische Ausbildung",12068,893,"7,4",7.3997348359297321]
["SDIIIInsgesamt45 bis unter 55 JahreAusländerInsgesamt",38252,2415,"6,3",6.3133953780194503]
["SDIIIInsgesamt45 bis unter 55 JahreAusländerKeine Berufsausbildung",23555,1512,"6,4",6.4190193164933129]
["SDIIIInsgesamt45 bis unter 55 JahreAusländerBetriebliche/schulische Ausbildung",10870,657,"6,0",6.044158233670653]
["SDIIIInsgesamt45 bis unter 55 JahreAusländerAkademische Ausbildung",3827,246,"6,4",6.4280114972563362]
["SDIIIInsgesamt55 und älterInsgesamtInsgesamt",125866,29905,"23,8",23.759394912049324]
["SDIIIInsgesamt55 und älterInsgesamtKeine Berufsausbildung",39854,8839,"22,2",22.178451347418076]
["SDIIIInsgesamt55 und älterInsgesamtBetriebliche/schulische Ausbildung",70058,17098,"24,4",24.405492591852465]
["SDIIIInsgesamt55 und älterInsgesamtAkademische Ausbildung",15954,3968,"24,9",24.871505578538297]
["SDIIIInsgesamt55 und älterDeutscheInsgesamt",104830,26606,"25,4",25.380139273108842]
["SDIIIInsgesamt55 und älterDeutscheKeine Berufsausbildung",26107,6559,"25,1",25.123530087715938]
["SDIIIInsgesamt55 und älterDeutscheBetriebliche/schulische Ausbildung",64437,16305,"25,3",25.303785092415847]
["SDIIIInsgesamt55 und älterDeutscheAkademische Ausbildung",14286,3742,"26,2",26.193476130477389]
["SDIIIInsgesamt55 und älterAusländerInsgesamt",21036,3299,"15,7",15.682639285035178]
["SDIIIInsgesamt55 und älterAusländerKeine Berufsausbildung",13747,2280,"16,6",16.585436822579471]
["SDIIIInsgesamt55 und älterAusländerBetriebliche/schulische Ausbildung",5621,793,"14,1",14.107809998220958]
["SDIIIInsgesamt55 und älterAusländerAkademische Ausbildung",1668,226,"13,5",13.549160671462829]
["SDIIIMännlichInsgesamtInsgesamtInsgesamt",381633,31325,"8,2",8.2081476182615223]
["SDIIIMännlichInsgesamtInsgesamtKeine Berufsausbildung",143942,10315,"7,2",7.1660807825374109]
["SDIIIMännlichInsgesamtInsgesamtBetriebliche/schulische Ausbildung",188814,16399,"8,7",8.6852669823212256]
["SDIIIMännlichInsgesamtInsgesamtAkademische Ausbildung",48877,4611,"9,4",9.4338850584119331]
["SDIIIMännlichInsgesamtDeutscheInsgesamt",262754,24857,"9,5",9.4601794834712312]
["SDIIIMännlichInsgesamtDeutscheKeine Berufsausbildung",68344,6088,"8,9",8.9078777946857084]
["SDIIIMännlichInsgesamtDeutscheBetriebliche/schulische Ausbildung",156197,14732,"9,4",9.4316792255933208]
["SDIIIMännlichInsgesamtDeutscheAkademische Ausbildung",38213,4037,"10,6",10.564467589563762]
["SDIIIMännlichInsgesamtAusländerInsgesamt",118879,6468,"5,4",5.4408263864938302]
["SDIIIMännlichInsgesamtAusländerKeine Berufsausbildung",75598,4227,"5,6",5.5914177623746664]
["SDIIIMännlichInsgesamtAusländerBetriebliche/schulische Ausbildung",32617,1667,"5,1",5.1108317748413405]
["SDIIIMännlichInsgesamtAusländerAkademische Ausbildung",10664,574,"5,4",5.3825956489122282]
["SDIIIMännlich15 bis unter 25 JahreInsgesamtInsgesamt",67702,1147,"1,7",1.6941892410859354]
["SDIIIMännlich15 bis unter 25 JahreInsgesamtKeine Berufsausbildung",30624,624,"2,0",2.0376175548589339]
["SDIIIMännlich15 bis unter 25 JahreInsgesamtBetriebliche/schulische Ausbildung",36030,510,"1,4",1.4154870940882598]
["SDIIIMännlich15 bis unter 25 JahreInsgesamtAkademische Ausbildung",1048,13,"1,2",1.2404580152671756]
["SDIIIMännlich15 bis unter 25 JahreDeutscheInsgesamt",52106,872,"1,7",1.673511687713507]
["SDIIIMännlich15 bis unter 25 JahreDeutscheKeine Berufsausbildung",19846,422,"2,1",2.1263730726594781]
["SDIIIMännlich15 bis unter 25 JahreDeutscheBetriebliche/schulische Ausbildung",31333,438,"1,4",1.3978872115660805]
["SDIIIMännlich15 bis unter 25 JahreDeutscheAkademische Ausbildung",927,12,"1,3",1.2944983818770228]
["SDIIIMännlich15 bis unter 25 JahreAusländerInsgesamt",15596,275,"1,8",1.7632726340087204]
["SDIIIMännlich15 bis unter 25 JahreAusländerKeine Berufsausbildung",10778,202,"1,9",1.874188161068844]
["SDIIIMännlich15 bis unter 25 JahreAusländerBetriebliche/schulische Ausbildung",4697,72,"1,5",1.5328933361720247]
["SDIIIMännlich15 bis unter 25 JahreAusländerAkademische Ausbildung","*","*","k.A.",{"$error":"#N/A"}]
["SDIIIMännlich25 bis unter 35 JahreInsgesamtInsgesamt",106390,4177,"3,9",3.9261208760221828]
["SDIIIMännlich25 bis unter 35 JahreInsgesamtKeine Berufsausbildung",39102,1818,"4,6",4.6493785484118453]
["SDIIIMännlich25 bis unter 35 JahreInsgesamtBetriebliche/schulische Ausbildung",49812,1808,"3,6",3.6296474745041358]
["SDIIIMännlich25 bis unter 35 JahreInsgesamtAkademische Ausbildung",17476,551,"3,2",3.152895399404898]
["SDIIIMännlich25 bis unter 35 JahreDeutscheInsgesamt",67664,2711,"4,0",4.006561834949161]
["SDIIIMännlich25 bis unter 35 JahreDeutscheKeine Berufsausbildung",14968,858,"5,7",5.7322287546766439]
["SDIIIMännlich25 bis unter 35 JahreDeutscheBetriebliche/schulische Ausbildung",39473,1452,"3,7",3.6784637600385071]
["SDIIIMännlich25 bis unter 35 JahreDeutscheAkademische Ausbildung",13223,401,"3,0",3.0325947213189139]
["SDIIIMännlich25 bis unter 35 JahreAusländerInsgesamt",38726,1466,"3,8",3.7855704178071581]
["SDIIIMännlich25 bis unter 35 JahreAusländerKeine Berufsausbildung",24134,960,"4,0",3.977790668766056]
["SDIIIMännlich25 bis unter 35 JahreAusländerBetriebliche/schulische Ausbildung",10339,356,"3,4",3.4432730438146826]
["SDIIIMännlich25 bis unter 35 JahreAusländerAkademische Ausbildung",4253,150,"3,5",3.5269221725840585]
["SDIIIMännlich35 bis unter 45 JahreInsgesamtInsgesamt",74010,3923,"5,3",5.3006350493176599]
["SDIIIMännlich35 bis unter 45 JahreInsgesamtKeine Berufsausbildung",28126,1526,"5,4",5.425584868093579]
["SDIIIMännlich35 bis unter 45 JahreInsgesamtBetriebliche/schulische Ausbildung",33381,1773,"5,3",5.311404691291453]
["SDIIIMännlich35 bis unter 45 JahreInsgesamtAkademische Ausbildung",12503,624,"5,0",4.9908022074702076]
["SDIIIMännlich35 bis unter 45 JahreDeutscheInsgesamt",44972,2551,"5,7",5.6724183936671713]
["SDIIIMännlich35 bis unter 45 JahreDeutscheKeine Berufsausbildung",10424,699,"6,7",6.7056792018419031]
["SDIIIMännlich35 bis unter 45 JahreDeutscheBetriebliche/schulische Ausbildung",25795,1397,"5,4",5.4157782515991473]
["SDIIIMännlich35 bis unter 45 JahreDeutscheAkademische Ausbildung",8753,455,"5,2",5.1982177539129442]
["SDIIIMännlich35 bis unter 45 JahreAusländerInsgesamt",29038,1372,"4,7",4.724843308767821]
["SDIIIMännlich35 bis unter 45 JahreAusländerKeine Berufsausbildung",17702,827,"4,7",4.6717884984747489]
["SDIIIMännlich35 bis unter 45 JahreAusländerBetriebliche/schulische Ausbildung",7586,376,"5,0",4.9564988136040071]
["SDIIIMännlich35 bis unter 45 JahreAusländerAkademische Ausbildung",3750,169,"4,5",4.5066666666666668]
["SDIIIMännlich45 bis unter 55 JahreInsgesamtInsgesamt",62204,4565,"7,3",7.3387563500739512]
["SDIIIMännlich45 bis unter 55 JahreInsgesamtKeine Berufsausbildung",23662,1668,"7,0",7.0492773222889022]
["SDIIIMännlich45 bis unter 55 JahreInsgesamtBetriebliche/schulische Ausbildung",30715,2263,"7,4",7.3677356340550224]
["SDIIIMännlich45 bis unter 55 JahreInsgesamtAkademische Ausbildung",7827,634,"8,1",8.1001660917337421]
["SDIIIMännlich45 bis unter 55 JahreDeutscheInsgesamt",40014,3218,"8,0",8.0421852351676915]
["SDIIIMännlich45 bis unter 55 JahreDeutscheKeine Berufsausbildung",9395,820,"8,7",8.7280468334220327]
["SDIIIMännlich45 bis unter 55 JahreDeutscheBetriebliche/schulische Ausbildung",24412,1892,"7,8",7.7502867442241525]
["SDIIIMännlich45 bis unter 55 JahreDeutscheAkademische Ausbildung",6207,506,"8,2",8.1520863541163191]
["SDIIIMännlich45 bis unter 55 JahreAusländerInsgesamt",22190,1347,"6,1",6.0703019378098242]
["SDIIIMännlich45 bis unter 55 JahreAusländerKeine Berufsausbildung",14267,848,"5,9",5.9437863601317726]
["SDIIIMännlich45 bis unter 55 JahreAusländerBetriebliche/schulische Ausbildung",6303,371,"5,9",5.8860859907980325]
["SDIIIMännlich45 bis unter 55 JahreAusländerAkademische Ausbildung",1620,128,"7,9",7.9012345679012341]
["SDIIIMännlich55 und älterInsgesamtInsgesamt",71327,17513,"24,6",24.553114528860039]
["SDIIIMännlich55 und älterInsgesamtKeine Berufsausbildung",22428,4679,"20,9",20.862314963438557]
["SDIIIMännlich55 und älterInsgesamtBetriebliche/schulische Ausbildung",38876,10045,"25,8",25.838563638234387]
["SDIIIMännlich55 und älterInsgesamtAkademische Ausbildung",10023,2789,"27,8",27.826000199541056]
["SDIIIMännlich55 und älterDeutscheInsgesamt",57998,15505,"26,7",26.733680471740406]
["SDIIIMännlich55 und älterDeutscheKeine Berufsausbildung",13711,3289,"24,0",23.98803880096273]
["SDIIIMännlich55 und älterDeutscheBetriebliche/schulische Ausbildung",35184,9553,"27,2",27.151546157344246]
["SDIIIMännlich55 und älterDeutscheAkademische Ausbildung",9103,2663,"29,3",29.25409205756344]
["SDIIIMännlich55 und älterAusländerInsgesamt",13329,2008,"15,1",15.064896091229649]
["SDIIIMännlich55 und älterAusländerKeine Berufsausbildung",8717,1390,"15,9",15.945852931054262]
["SDIIIMännlich55 und älterAusländerBetriebliche/schulische Ausbildung",3692,492,"13,3",13.326110509209101]
["SDIIIMännlich55 und älterAusländerAkademische Ausbildung",920,126,"13,7",13.695652173913043]
["SDIIIWeiblichInsgesamtInsgesamtInsgesamt",289592,23246,"8,0",8.0271554462830466]
["SDIIIWeiblichInsgesamtInsgesamtKeine Berufsausbildung",85173,7798,"9,2",9.1554835452549508]
["SDIIIWeiblichInsgesamtInsgesamtBetriebliche/schulische Ausbildung",147940,12291,"8,3",8.3080978775179126]
["SDIIIWeiblichInsgesamtInsgesamtAkademische Ausbildung",56479,3157,"5,6",5.5896882026948074]
["SDIIIWeiblichInsgesamtDeutscheInsgesamt",215276,18449,"8,6",8.5699288355413508]
["SDIIIWeiblichInsgesamtDeutscheKeine Berufsausbildung",48144,5050,"10,5",10.489365237620472]
["SDIIIWeiblichInsgesamtDeutscheBetriebliche/schulische Ausbildung",126599,10993,"8,7",8.6833229330405448]
["SDIIIWeiblichInsgesamtDeutscheAkademische Ausbildung",40533,2406,"5,9",5.9359040781585373]
["SDIIIWeiblichInsgesamtAusländerInsgesamt",74316,4797,"6,5",6.4548683998062319]
["SDIIIWeiblichInsgesamtAusländerKeine Berufsausbildung",37029,2748,"7,4",7.4212104026573771]
["SDIIIWeiblichInsgesamtAusländerBetriebliche/schulische Ausbildung",21341,1298,"6,1",6.0821892132514872]
["SDIIIWeiblichInsgesamtAusländerAkademische Ausbildung",15946,751,"4,7",4.7096450520506714]
["SDIIIWeiblich15 bis unter 25 JahreInsgesamtInsgesamt",44184,656,"1,5",1.4847003440159334]
["SDIIIWeiblich15 bis unter 25 JahreInsgesamtKeine Berufsausbildung",16774,324,"1,9",1.9315607487778705]
["SDIIIWeiblich15 bis unter 25 JahreInsgesamtBetriebliche/schulische Ausbildung",25724,321,"1,2",1.2478619188306639]
["SDIIIWeiblich15 bis unter 25 JahreInsgesamtAkademische Ausbildung",1686,11,"0,7",0.65243179122182682]
["SDIIIWeiblich15 bis unter 25 JahreDeutscheInsgesamt",36187,504,"1,4",1.39276535772515]
["SDIIIWeiblich15 bis unter 25 JahreDeutscheKeine Berufsausbildung",12284,238,"1,9",1.9374796483230219]
["SDIIIWeiblich15 bis unter 25 JahreDeutscheBetriebliche/schulische Ausbildung",22510,261,"1,2",1.1594846734784539]
["SDIIIWeiblich15 bis unter 25 JahreDeutscheAkademische Ausbildung",1393,5,"0,4",0.35893754486719309]
["SDIIIWeiblich15 bis unter 25 JahreAusländerInsgesamt",7997,152,"1,9",1.9007127672877329]
["SDIIIWeiblich15 bis unter 25 JahreAusländerKeine Berufsausbildung",4490,86,"1,9",1.915367483296214]
["SDIIIWeiblich15 bis unter 25 JahreAusländerBetriebliche/schulische Ausbildung",3214,60,"1,9",1.8668326073428747]
["SDIIIWeiblich15 bis unter 25 JahreAusländerAkademische Ausbildung","*","*","2,0",2.0477815699658701]
["SDIIIWeiblich25 bis unter 35 JahreInsgesamtInsgesamt",76108,3021,"4,0",3.9693593314763227]
["SDIIIWeiblich25 bis unter 35 JahreInsgesamtKeine Berufsausbildung",17329,960,"5,5",5.5398465000865604]
["SDIIIWeiblich25 bis unter 35 JahreInsgesamtBetriebliche/schulische Ausbildung",34589,1437,"4,2",4.154499985544537]
["SDIIIWeiblich25 bis unter 35 JahreInsgesamtAkademische Ausbildung",24190,624,"2,6",2.5795783381562627]
["SDIIIWeiblich25 bis unter 35 JahreDeutscheInsgesamt",53779,1952,"3,6",3.6296695736253928]
["SDIIIWeiblich25 bis unter 35 JahreDeutscheKeine Berufsausbildung",8249,457,"5,5",5.5400654624803005]
["SDIIIWeiblich25 bis unter 35 JahreDeutscheBetriebliche/schulische Ausbildung",28198,1112,"3,9",3.9435420951840556]
["SDIIIWeiblich25 bis unter 35 JahreDeutscheAkademische Ausbildung",17332,383,"2,2",2.2097853681052388]
["SDIIIWeiblich25 bis unter 35 JahreAusländerInsgesamt",22329,1069,"4,8",4.7874960813292127]
["SDIIIWeiblich25 bis unter 35 JahreAusländerKeine Berufsausbildung",9080,503,"5,5",5.5396475770925111]
["SDIIIWeiblich25 bis unter 35 JahreAusländerBetriebliche/schulische Ausbildung",6391,325,"5,1",5.0852761696135191]
["SDIIIWeiblich25 bis unter 35 JahreAusländerAkademische Ausbildung",6858,241,"3,5",3.5141440653251679]
["SDIIIWeiblich35 bis unter 45 JahreInsgesamtInsgesamt",60313,3460,"5,7",5.7367400063004652]
["SDIIIWeiblich35 bis unter 45 JahreInsgesamtKeine Berufsausbildung",16224,1062,"6,5",6.5458579881656807]
["SDIIIWeiblich35 bis unter 45 JahreInsgesamtBetriebliche/schulische Ausbildung",27485,1560,"5,7",5.6758231762779703]
["SDIIIWeiblich35 bis unter 45 JahreInsgesamtAkademische Ausbildung",16604,838,"5,0",5.0469766321368343]
["SDIIIWeiblich35 bis unter 45 JahreDeutscheInsgesamt",40091,2243,"5,6",5.5947718939412834]
["SDIIIWeiblich35 bis unter 45 JahreDeutscheKeine Berufsausbildung",7082,457,"6,5",6.4529793843547028]
["SDIIIWeiblich35 bis unter 45 JahreDeutscheBetriebliche/schulische Ausbildung",22245,1234,"5,5",5.5473140031467745]
["SDIIIWeiblich35 bis unter 45 JahreDeutscheAkademische Ausbildung",10764,552,"5,1",5.1282051282051277]
["SDIIIWeiblich35 bis unter 45 JahreAusländerInsgesamt",20222,1217,"6,0",6.0181980021758479]
["SDIIIWeiblich35 bis unter 45 JahreAusländerKeine Berufsausbildung",9142,605,"6,6",6.617807919492452]
["SDIIIWeiblich35 bis unter 45 JahreAusländerBetriebliche/schulische Ausbildung",5240,326,"6,2",6.221374045801527]
["SDIIIWeiblich35 bis unter 45 JahreAusländerAkademische Ausbildung",5840,286,"4,9",4.897260273972603]
["SDIIIWeiblich45 bis unter 55 JahreInsgesamtInsgesamt",54450,3717,"6,8",6.8264462809917354]
["SDIIIWeiblich45 bis unter 55 JahreInsgesamtKeine Berufsausbildung",17422,1292,"7,4",7.4159109172310878]
["SDIIIWeiblich45 bis unter 55 JahreInsgesamtBetriebliche/schulische Ausbildung",28960,1920,"6,6",6.6298342541436464]
["SDIIIWeiblich45 bis unter 55 JahreInsgesamtAkademische Ausbildung",8068,505,"6,3",6.2592959841348534]
["SDIIIWeiblich45 bis unter 55 JahreDeutscheInsgesamt",38388,2649,"6,9",6.900593935604876]
["SDIIIWeiblich45 bis unter 55 JahreDeutscheKeine Berufsausbildung",8134,628,"7,7",7.7206786328989434]
["SDIIIWeiblich45 bis unter 55 JahreDeutscheBetriebliche/schulische Ausbildung",24393,1634,"6,7",6.6986430533349726]
["SDIIIWeiblich45 bis unter 55 JahreDeutscheAkademische Ausbildung",5861,387,"6,6",6.6029687766592735]
["SDIIIWeiblich45 bis unter 55 JahreAusländerInsgesamt",16062,1068,"6,6",6.6492342174075461]
["SDIIIWeiblich45 bis unter 55 JahreAusländerKeine Berufsausbildung",9288,664,"7,1",7.1490094745908701]
["SDIIIWeiblich45 bis unter 55 JahreAusländerBetriebliche/schulische Ausbildung",4567,286,"6,3",6.2623166192248743]
["SDIIIWeiblich45 bis unter 55 JahreAusländerAkademische Ausbildung",2207,118,"5,3",5.3466243769823292]
["SDIIIWeiblich55 und älterInsgesamtInsgesamt",54537,12392,"22,7",22.72218860590058]
["SDIIIWeiblich55 und älterInsgesamtKeine Berufsausbildung",17424,4160,"23,9",23.875114784205692]
["SDIIIWeiblich55 und älterInsgesamtBetriebliche/schulische Ausbildung",31182,7053,"22,6",22.618818549162977]
["SDIIIWeiblich55 und älterInsgesamtAkademische Ausbildung",5931,1179,"19,9",19.878603945371776]
["SDIIIWeiblich55 und älterDeutscheInsgesamt",46831,11101,"23,7",23.704383848305611]
["SDIIIWeiblich55 und älterDeutscheKeine Berufsausbildung",12395,3270,"26,4",26.3816054860831]
["SDIIIWeiblich55 und älterDeutscheBetriebliche/schulische Ausbildung",29253,6752,"23,1",23.081393361364647]
["SDIIIWeiblich55 und älterDeutscheAkademische Ausbildung",5183,1079,"20,8",20.818059039166506]
["SDIIIWeiblich55 und älterAusländerInsgesamt",7706,1291,"16,8",16.753179340773421]
["SDIIIWeiblich55 und älterAusländerKeine Berufsausbildung",5029,890,"17,7",17.697355339033606]
["SDIIIWeiblich55 und älterAusländerBetriebliche/schulische Ausbildung",1929,301,"15,6",15.603939865215139]
["SDIIIWeiblich55 und älterAusländerAkademische Ausbildung",748,100,"13,4",13.368983957219251]
["SDIIInsgesamtInsgesamtInsgesamtInsgesamt",431426,64666,"15,0",14.988897284818254]
["SDIIInsgesamtInsgesamtInsgesamtKeine Berufsausbildung",315909,45976,"14,6",14.553558144908818]
["SDIIInsgesamtInsgesamtInsgesamtBetriebliche/schulische Ausbildung",82852,14695,"17,7",17.736445710423407]
["SDIIInsgesamtInsgesamtInsgesamtAkademische Ausbildung",32665,3995,"12,2",12.23021582733813]
["SDIIInsgesamtInsgesamtDeutscheInsgesamt",158417,27800,"17,5",17.548621675703995]
["SDIIInsgesamtInsgesamtDeutscheKeine Berufsausbildung",90951,15934,"17,5",17.519323591824168]
["SDIIInsgesamtInsgesamtDeutscheBetriebliche/schulische Ausbildung",58792,10681,"18,2",18.167437746632196]
["SDIIInsgesamtInsgesamtDeutscheAkademische Ausbildung",8674,1185,"13,7",13.661517177772653]
["SDIIInsgesamtInsgesamtAusländerInsgesamt",273007,36866,"13,5",13.503683055745825]
["SDIIInsgesamtInsgesamtAusländerKeine Berufsausbildung",224956,30042,"13,4",13.354611568484504]
["SDIIInsgesamtInsgesamtAusländerBetriebliche/schulische Ausbildung",24060,4014,"16,7",16.683291770573565]
["SDIIInsgesamtInsgesamtAusländerAkademische Ausbildung",23991,2810,"11,7",11.712725605435372]
["SDIIInsgesamt15 bis unter 25 JahreInsgesamtInsgesamt",65233,4729,"7,2",7.249398310670979]
["SDIIInsgesamt15 bis unter 25 JahreInsgesamtKeine Berufsausbildung",60031,4369,"7,3",7.277906415018907]
["SDIIInsgesamt15 bis unter 25 JahreInsgesamtBetriebliche/schulische Ausbildung",3728,267,"7,2",7.1620171673819746]
["SDIIInsgesamt15 bis unter 25 JahreInsgesamtAkademische Ausbildung",1474,93,"6,3",6.3093622795115341]
["SDIIInsgesamt15 bis unter 25 JahreDeutscheInsgesamt",23295,2190,"9,4",9.4011590470057964]
["SDIIInsgesamt15 bis unter 25 JahreDeutscheKeine Berufsausbildung",20857,2012,"9,6",9.6466414153521605]
["SDIIInsgesamt15 bis unter 25 JahreDeutscheBetriebliche/schulische Ausbildung",2183,166,"7,6",7.6042143838754006]
["SDIIInsgesamt15 bis unter 25 JahreDeutscheAkademische Ausbildung",255,12,"4,7",4.7058823529411766]
["SDIIInsgesamt15 bis unter 25 JahreAusländerInsgesamt",41937,2539,"6,1",6.0543195745999947]
["SDIIInsgesamt15 bis unter 25 JahreAusländerKeine Berufsausbildung",39173,2357,"6,0",6.016899394991448]
["SDIIInsgesamt15 bis unter 25 JahreAusländerBetriebliche/schulische Ausbildung",1545,101,"6,5",6.5372168284789645]
["SDIIInsgesamt15 bis unter 25 JahreAusländerAkademische Ausbildung",1219,81,"6,6",6.6447908121410997]
["SDIIInsgesamt25 bis unter 35 JahreInsgesamtInsgesamt",105276,15628,"14,8",14.84478893574984]
["SDIIInsgesamt25 bis unter 35 JahreInsgesamtKeine Berufsausbildung",76375,11628,"15,2",15.224877250409167]
["SDIIInsgesamt25 bis unter 35 JahreInsgesamtBetriebliche/schulische Ausbildung",18172,3068,"16,9",16.883116883116884]
["SDIIInsgesamt25 bis unter 35 JahreInsgesamtAkademische Ausbildung",10729,932,"8,7",8.6867368813496135]
["SDIIInsgesamt25 bis unter 35 JahreDeutscheInsgesamt",38485,6889,"17,9",17.900480706768871]
["SDIIInsgesamt25 bis unter 35 JahreDeutscheKeine Berufsausbildung",22130,4390,"19,8",19.837324898328063]
["SDIIInsgesamt25 bis unter 35 JahreDeutscheBetriebliche/schulische Ausbildung",12649,2238,"17,7",17.693098268637836]
["SDIIInsgesamt25 bis unter 35 JahreDeutscheAkademische Ausbildung",3706,261,"7,0",7.0426335671883429]
["SDIIInsgesamt25 bis unter 35 JahreAusländerInsgesamt",66791,8739,"13,1",13.084098156937312]
["SDIIInsgesamt25 bis unter 35 JahreAusländerKeine Berufsausbildung",54245,7238,"13,3",13.34316526868836]
["SDIIInsgesamt25 bis unter 35 JahreAusländerBetriebliche/schulische Ausbildung",5523,830,"15,0",15.028064457722252]
["SDIIInsgesamt25 bis unter 35 JahreAusländerAkademische Ausbildung",7023,671,"9,6",9.5543215150220693]
["SDIIInsgesamt35 bis unter 45 JahreInsgesamtInsgesamt",113225,18074,"16,0",15.9629057187017]
["SDIIInsgesamt35 bis unter 45 JahreInsgesamtKeine Berufsausbildung",79993,12634,"15,8",15.793881964671908]
["SDIIInsgesamt35 bis unter 45 JahreInsgesamtBetriebliche/schulische Ausbildung",21745,4020,"18,5",18.487008507702921]
["SDIIInsgesamt35 bis unter 45 JahreInsgesamtAkademische Ausbildung",11487,1420,"12,4",12.361800295986768]
["SDIIInsgesamt35 bis unter 45 JahreDeutscheInsgesamt",33914,6964,"20,5",20.534292622515775]
["SDIIInsgesamt35 bis unter 45 JahreDeutscheKeine Berufsausbildung",17384,3786,"21,8",21.778647031753337]
["SDIIInsgesamt35 bis unter 45 JahreDeutscheBetriebliche/schulische Ausbildung",14426,2825,"19,6",19.582697906557605]
["SDIIInsgesamt35 bis unter 45 JahreDeutscheAkademische Ausbildung",2104,353,"16,8",16.777566539923956]
["SDIIInsgesamt35 bis unter 45 JahreAusländerInsgesamt",79310,11110,"14,0",14.008321775312066]
["SDIIInsgesamt35 bis unter 45 JahreAusländerKeine Berufsausbildung",62608,8848,"14,1",14.132379248658319]
["SDIIInsgesamt35 bis unter 45 JahreAusländerBetriebliche/schulische Ausbildung",7319,1195,"16,3",16.327367126656647]
["SDIIInsgesamt35 bis unter 45 JahreAusländerAkademische Ausbildung",9383,1067,"11,4",11.371629542790153]
["SDIIInsgesamt45 bis unter 55 JahreInsgesamtInsgesamt",84352,14031,"16,6",16.63386760242792]
["SDIIInsgesamt45 bis unter 55 JahreInsgesamtKeine Berufsausbildung",57340,9491,"16,6",16.552145099407046]
["SDIIInsgesamt45 bis unter 55 JahreInsgesamtBetriebliche/schulische Ausbildung",21283,3720,"17,5",17.478738899591225]
["SDIIInsgesamt45 bis unter 55 JahreInsgesamtAkademische Ausbildung",5729,820,"14,3",14.313143655088147]
["SDIIInsgesamt45 bis unter 55 JahreDeutscheInsgesamt",31781,5759,"18,1",18.120889839841414]
["SDIIInsgesamt45 bis unter 55 JahreDeutscheKeine Berufsausbildung",15405,2871,"18,6",18.636806231742941]
["SDIIInsgesamt45 bis unter 55 JahreDeutscheBetriebliche/schulische Ausbildung",15004,2637,"17,6",17.575313249800054]
["SDIIInsgesamt45 bis unter 55 JahreDeutscheAkademische Ausbildung",1372,251,"18,3",18.294460641399418]
["SDIIInsgesamt45 bis unter 55 JahreAusländerInsgesamt",52571,8272,"15,7",15.734910882425671]
["SDIIInsgesamt45 bis unter 55 JahreAusländerKeine Berufsausbildung",41935,6620,"15,8",15.786335996184572]
["SDIIInsgesamt45 bis unter 55 JahreAusländerBetriebliche/schulische Ausbildung",6279,1083,"17,2",17.247969421882463]
["SDIIInsgesamt45 bis unter 55 JahreAusländerAkademische Ausbildung",4357,569,"13,1",13.059444571953179]
["SDIIInsgesamt55 und älterInsgesamtInsgesamt",63340,12204,"19,3",19.267445532049258]
["SDIIInsgesamt55 und älterInsgesamtKeine Berufsausbildung",42170,7854,"18,6",18.624614654967985]
["SDIIInsgesamt55 und älterInsgesamtBetriebliche/schulische Ausbildung",17924,3620,"20,2",20.196384735550097]
["SDIIInsgesamt55 und älterInsgesamtAkademische Ausbildung",3246,730,"22,5",22.489217498459642]
["SDIIInsgesamt55 und älterDeutscheInsgesamt",30942,5998,"19,4",19.384655161269471]
["SDIIInsgesamt55 und älterDeutscheKeine Berufsausbildung",15175,2875,"18,9",18.945634266886326]
["SDIIInsgesamt55 und älterDeutscheBetriebliche/schulische Ausbildung",14530,2815,"19,4",19.373709566414316]
["SDIIInsgesamt55 und älterDeutscheAkademische Ausbildung",1237,308,"24,9",24.898949070331447]
["SDIIInsgesamt55 und älterAusländerInsgesamt",32398,6206,"19,2",19.155503426137415]
["SDIIInsgesamt55 und älterAusländerKeine Berufsausbildung",26995,4979,"18,4",18.444156325245416]
["SDIIInsgesamt55 und älterAusländerBetriebliche/schulische Ausbildung",3394,805,"23,7",23.718326458456097]
["SDIIInsgesamt55 und älterAusländerAkademische Ausbildung",2009,422,"21,0",21.005475360876058]
["SDIIMännlichInsgesamtInsgesamtInsgesamt",196616,30769,"15,6",15.649285917727957]
["SDIIMännlichInsgesamtInsgesamtKeine Berufsausbildung",140935,21056,"14,9",14.940220669102777]
["SDIIMännlichInsgesamtInsgesamtBetriebliche/schulische Ausbildung",43560,8033,"18,4",18.441230486685033]
["SDIIMännlichInsgesamtInsgesamtAkademische Ausbildung",12121,1680,"13,9",13.860242554244701]
["SDIIMännlichInsgesamtDeutscheInsgesamt",84786,15508,"18,3",18.29075554926521]
["SDIIMännlichInsgesamtDeutscheKeine Berufsausbildung",47342,8531,"18,0",18.019940010983902]
["SDIIMännlichInsgesamtDeutscheBetriebliche/schulische Ausbildung",33099,6297,"19,0",19.024743949968276]
["SDIIMännlichInsgesamtDeutscheAkademische Ausbildung",4345,680,"15,7",15.650172612197929]
["SDIIMännlichInsgesamtAusländerInsgesamt",111828,15261,"13,6",13.646850520442108]
["SDIIMännlichInsgesamtAusländerKeine Berufsausbildung",93591,12525,"13,4",13.382697054203929]
["SDIIMännlichInsgesamtAusländerBetriebliche/schulische Ausbildung",10461,1736,"16,6",16.594971800019117]
["SDIIMännlichInsgesamtAusländerAkademische Ausbildung",7776,1000,"12,9",12.860082304526749]
["SDIIMännlich15 bis unter 25 JahreInsgesamtInsgesamt",33554,2602,"7,8",7.7546641235024136]
["SDIIMännlich15 bis unter 25 JahreInsgesamtKeine Berufsausbildung",31485,2445,"7,8",7.7656026679371131]
["SDIIMännlich15 bis unter 25 JahreInsgesamtBetriebliche/schulische Ausbildung",1679,132,"7,9",7.861822513400833]
["SDIIMännlich15 bis unter 25 JahreInsgesamtAkademische Ausbildung",390,25,"6,4",6.4102564102564097]
["SDIIMännlich15 bis unter 25 JahreDeutscheInsgesamt",12160,1198,"9,9",9.8519736842105257]
["SDIIMännlich15 bis unter 25 JahreDeutscheKeine Berufsausbildung",11052,1111,"10,1",10.052479189287007]
["SDIIMännlich15 bis unter 25 JahreDeutscheBetriebliche/schulische Ausbildung",1005,81,"8,1",8.0597014925373127]
["SDIIMännlich15 bis unter 25 JahreDeutscheAkademische Ausbildung",103,6,"5,8",5.825242718446602]
["SDIIMännlich15 bis unter 25 JahreAusländerInsgesamt",21393,1404,"6,6",6.5628944047118223]
["SDIIMännlich15 bis unter 25 JahreAusländerKeine Berufsausbildung",20432,1334,"6,5",6.5289741581832414]
["SDIIMännlich15 bis unter 25 JahreAusländerBetriebliche/schulische Ausbildung",674,51,"7,6",7.5667655786350156]
["SDIIMännlich15 bis unter 25 JahreAusländerAkademische Ausbildung","*","*","6,6",6.6202090592334493]
["SDIIMännlich25 bis unter 35 JahreInsgesamtInsgesamt",49982,7529,"15,1",15.063422832219601]
["SDIIMännlich25 bis unter 35 JahreInsgesamtKeine Berufsausbildung",36171,5573,"15,4",15.4073705454646]
["SDIIMännlich25 bis unter 35 JahreInsgesamtBetriebliche/schulische Ausbildung",9511,1576,"16,6",16.570287036063505]
["SDIIMännlich25 bis unter 35 JahreInsgesamtAkademische Ausbildung",4300,380,"8,8",8.8372093023255811]
["SDIIMännlich25 bis unter 35 JahreDeutscheInsgesamt",20764,3754,"18,1",18.079368137160472]
["SDIIMännlich25 bis unter 35 JahreDeutscheKeine Berufsausbildung",12021,2381,"19,8",19.807004408951002]
["SDIIMännlich25 bis unter 35 JahreDeutscheBetriebliche/schulische Ausbildung",6971,1230,"17,6",17.644527327499642]
["SDIIMännlich25 bis unter 35 JahreDeutscheAkademische Ausbildung",1772,143,"8,1",8.0699774266365694]
["SDIIMännlich25 bis unter 35 JahreAusländerInsgesamt",29218,3775,"12,9",12.92011773564241]
["SDIIMännlich25 bis unter 35 JahreAusländerKeine Berufsausbildung",24150,3192,"13,2",13.217391304347824]
["SDIIMännlich25 bis unter 35 JahreAusländerBetriebliche/schulische Ausbildung",2540,346,"13,6",13.622047244094487]
["SDIIMännlich25 bis unter 35 JahreAusländerAkademische Ausbildung",2528,237,"9,4",9.375]
["SDIIMännlich35 bis unter 45 JahreInsgesamtInsgesamt",46618,8014,"17,2",17.190784675447251]
["SDIIMännlich35 bis unter 45 JahreInsgesamtKeine Berufsausbildung",31934,5379,"16,8",16.844115989227781]
["SDIIMännlich35 bis unter 45 JahreInsgesamtBetriebliche/schulische Ausbildung",10844,2096,"19,3",19.328661010697161]
["SDIIMännlich35 bis unter 45 JahreInsgesamtAkademische Ausbildung",3840,539,"14,0",14.036458333333332]
["SDIIMännlich35 bis unter 45 JahreDeutscheInsgesamt",17939,3788,"21,1",21.116004236579521]
["SDIIMännlich35 bis unter 45 JahreDeutscheKeine Berufsausbildung",9030,2008,"22,2",22.236987818383167]
["SDIIMännlich35 bis unter 45 JahreDeutscheBetriebliche/schulische Ausbildung",7887,1591,"20,2",20.172435653607202]
["SDIIMännlich35 bis unter 45 JahreDeutscheAkademische Ausbildung",1022,189,"18,5",18.493150684931507]
["SDIIMännlich35 bis unter 45 JahreAusländerInsgesamt",28678,4226,"14,7",14.736034590975661]
["SDIIMännlich35 bis unter 45 JahreAusländerKeine Berufsausbildung",22903,3371,"14,7",14.718595817141859]
["SDIIMännlich35 bis unter 45 JahreAusländerBetriebliche/schulische Ausbildung",2957,505,"17,1",17.078119715928306]
["SDIIMännlich35 bis unter 45 JahreAusländerAkademische Ausbildung",2818,350,"12,4",12.42015613910575]
["SDIIMännlich45 bis unter 55 JahreInsgesamtInsgesamt",37164,6764,"18,2",18.200408997955012]
["SDIIMännlich45 bis unter 55 JahreInsgesamtKeine Berufsausbildung",23659,4249,"18,0",17.959338940783635]
["SDIIMännlich45 bis unter 55 JahreInsgesamtBetriebliche/schulische Ausbildung",11380,2151,"18,9",18.901581722319861]
["SDIIMännlich45 bis unter 55 JahreInsgesamtAkademische Ausbildung",2125,364,"17,1",17.129411764705882]
["SDIIMännlich45 bis unter 55 JahreDeutscheInsgesamt",17159,3376,"19,7",19.674806224138937]
["SDIIMännlich45 bis unter 55 JahreDeutscheKeine Berufsausbildung",7818,1589,"20,3",20.324891276541315]
["SDIIMännlich45 bis unter 55 JahreDeutscheBetriebliche/schulische Ausbildung",8617,1643,"19,1",19.06696065916212]
["SDIIMännlich45 bis unter 55 JahreDeutscheAkademische Ausbildung",724,144,"19,9",19.88950276243094]
["SDIIMännlich45 bis unter 55 JahreAusländerInsgesamt",20005,3388,"16,9",16.935766058485381]
["SDIIMännlich45 bis unter 55 JahreAusländerKeine Berufsausbildung",15841,2660,"16,8",16.791869200176755]
["SDIIMännlich45 bis unter 55 JahreAusländerBetriebliche/schulische Ausbildung",2763,508,"18,4",18.385812522620341]
["SDIIMännlich45 bis unter 55 JahreAusländerAkademische Ausbildung",1401,220,"15,7",15.703069236259815]
["SDIIMännlich55 und älterInsgesamtInsgesamt",29298,5860,"20,0",20.001365280906548]
["SDIIMännlich55 und älterInsgesamtKeine Berufsausbildung",17686,3410,"19,3",19.280787063213843]
["SDIIMännlich55 und älterInsgesamtBetriebliche/schulische Ausbildung",10146,2078,"20,5",20.480977725211908]
["SDIIMännlich55 und älterInsgesamtAkademische Ausbildung",1466,372,"25,4",25.375170532060025]
["SDIIMännlich55 und älterDeutscheInsgesamt",16764,3392,"20,2",20.233834407062755]
["SDIIMännlich55 und älterDeutscheKeine Berufsausbildung",7421,1442,"19,4",19.431343484705565]
["SDIIMännlich55 und älterDeutscheBetriebliche/schulische Ausbildung",8619,1752,"20,3",20.327184128089105]
["SDIIMännlich55 und älterDeutscheAkademische Ausbildung",724,198,"27,3",27.348066298342545]
["SDIIMännlich55 und älterAusländerInsgesamt",12534,2468,"19,7",19.690441997766076]
["SDIIMännlich55 und älterAusländerKeine Berufsausbildung",10265,1968,"19,2",19.171943497320992]
["SDIIMännlich55 und älterAusländerBetriebliche/schulische Ausbildung",1527,326,"21,3",21.349050425671251]
["SDIIMännlich55 und älterAusländerAkademische Ausbildung",742,174,"23,5",23.450134770889488]
["SDIIWeiblichInsgesamtInsgesamtInsgesamt",234808,33897,"14,4",14.436049879050117]
["SDIIWeiblichInsgesamtInsgesamtKeine Berufsausbildung",174972,24920,"14,2",14.242278764602338]
["SDIIWeiblichInsgesamtInsgesamtBetriebliche/schulische Ausbildung",39292,6662,"17,0",16.955105364959788]
["SDIIWeiblichInsgesamtInsgesamtAkademische Ausbildung",20544,2315,"11,3",11.268496884735201]
["SDIIWeiblichInsgesamtDeutscheInsgesamt",73631,12292,"16,7",16.694055492930968]
["SDIIWeiblichInsgesamtDeutscheKeine Berufsausbildung",43609,7403,"17,0",16.975853608200143]
["SDIIWeiblichInsgesamtDeutscheBetriebliche/schulische Ausbildung",25693,4384,"17,1",17.063013272097457]
["SDIIWeiblichInsgesamtDeutscheAkademische Ausbildung",4329,505,"11,7",11.665511665511666]
["SDIIWeiblichInsgesamtAusländerInsgesamt",161177,21605,"13,4",13.404518014356887]
["SDIIWeiblichInsgesamtAusländerKeine Berufsausbildung",131363,17517,"13,3",13.334805082100743]
["SDIIWeiblichInsgesamtAusländerBetriebliche/schulische Ausbildung",13599,2278,"16,8",16.75123170821384]
["SDIIWeiblichInsgesamtAusländerAkademische Ausbildung",16215,1810,"11,2",11.16250385445575]
["SDIIWeiblich15 bis unter 25 JahreInsgesamtInsgesamt",31679,2127,"6,7",6.7142270905015939]
["SDIIWeiblich15 bis unter 25 JahreInsgesamtKeine Berufsausbildung",28546,1924,"6,7",6.7399985987528899]
["SDIIWeiblich15 bis unter 25 JahreInsgesamtBetriebliche/schulische Ausbildung",2049,135,"6,6",6.5885797950219622]
["SDIIWeiblich15 bis unter 25 JahreInsgesamtAkademische Ausbildung",1084,68,"6,3",6.2730627306273057]
["SDIIWeiblich15 bis unter 25 JahreDeutscheInsgesamt",11135,992,"8,9",8.9088459811405478]
["SDIIWeiblich15 bis unter 25 JahreDeutscheKeine Berufsausbildung",9805,901,"9,2",9.1891891891891895]
["SDIIWeiblich15 bis unter 25 JahreDeutscheBetriebliche/schulische Ausbildung",1178,85,"7,2",7.2156196943972839]
["SDIIWeiblich15 bis unter 25 JahreDeutscheAkademische Ausbildung",152,6,"3,9",3.9473684210526314]
["SDIIWeiblich15 bis unter 25 JahreAusländerInsgesamt",20544,1135,"5,5",5.5247274143302185]
["SDIIWeiblich15 bis unter 25 JahreAusländerKeine Berufsausbildung",18741,1023,"5,5",5.4586201376660801]
["SDIIWeiblich15 bis unter 25 JahreAusländerBetriebliche/schulische Ausbildung",871,50,"5,7",5.7405281285878305]
["SDIIWeiblich15 bis unter 25 JahreAusländerAkademische Ausbildung","*","*","6,7",6.6523605150214591]
["SDIIWeiblich25 bis unter 35 JahreInsgesamtInsgesamt",55293,8099,"14,6",14.64742372452209]
["SDIIWeiblich25 bis unter 35 JahreInsgesamtKeine Berufsausbildung",40203,6055,"15,1",15.061065094644679]
["SDIIWeiblich25 bis unter 35 JahreInsgesamtBetriebliche/schulische Ausbildung",8661,1492,"17,2",17.2266481930493]
["SDIIWeiblich25 bis unter 35 JahreInsgesamtAkademische Ausbildung",6429,552,"8,6",8.5860942603826409]
["SDIIWeiblich25 bis unter 35 JahreDeutscheInsgesamt",17721,3135,"17,7",17.690875232774676]
["SDIIWeiblich25 bis unter 35 JahreDeutscheKeine Berufsausbildung",10109,2009,"19,9",19.873380156296371]
["SDIIWeiblich25 bis unter 35 JahreDeutscheBetriebliche/schulische Ausbildung",5678,1008,"17,8",17.752729834448751]
["SDIIWeiblich25 bis unter 35 JahreDeutscheAkademische Ausbildung",1934,118,"6,1",6.1013443640124096]
["SDIIWeiblich25 bis unter 35 JahreAusländerInsgesamt",37572,4964,"13,2",13.211966357926116]
["SDIIWeiblich25 bis unter 35 JahreAusländerKeine Berufsausbildung",30094,4046,"13,4",13.444540439954809]
["SDIIWeiblich25 bis unter 35 JahreAusländerBetriebliche/schulische Ausbildung",2983,484,"16,2",16.225276567214213]
["SDIIWeiblich25 bis unter 35 JahreAusländerAkademische Ausbildung",4495,434,"9,7",9.6551724137931032]
["SDIIWeiblich35 bis unter 45 JahreInsgesamtInsgesamt",66607,10060,"15,1",15.103517648295226]
["SDIIWeiblich35 bis unter 45 JahreInsgesamtKeine Berufsausbildung",48059,7255,"15,1",15.096027799163528]
["SDIIWeiblich35 bis unter 45 JahreInsgesamtBetriebliche/schulische Ausbildung",10901,1924,"17,6",17.649756903036419]
["SDIIWeiblich35 bis unter 45 JahreInsgesamtAkademische Ausbildung",7647,881,"11,5",11.520857852752714]
["SDIIWeiblich35 bis unter 45 JahreDeutscheInsgesamt",15975,3176,"19,9",19.881064162754303]
["SDIIWeiblich35 bis unter 45 JahreDeutscheKeine Berufsausbildung",8354,1778,"21,3",21.283217620301652]
["SDIIWeiblich35 bis unter 45 JahreDeutscheBetriebliche/schulische Ausbildung",6539,1234,"18,9",18.871387062241933]
["SDIIWeiblich35 bis unter 45 JahreDeutscheAkademische Ausbildung",1082,164,"15,2",15.157116451016636]
["SDIIWeiblich35 bis unter 45 JahreAusländerInsgesamt",50632,6884,"13,6",13.59614473060515]
["SDIIWeiblich35 bis unter 45 JahreAusländerKeine Berufsausbildung",39705,5477,"13,8",13.794232464425136]
["SDIIWeiblich35 bis unter 45 JahreAusländerBetriebliche/schulische Ausbildung",4362,690,"15,8",15.818431911966988]
["SDIIWeiblich35 bis unter 45 JahreAusländerAkademische Ausbildung",6565,717,"10,9",10.921553693830921]
["SDIIWeiblich45 bis unter 55 JahreInsgesamtInsgesamt",47188,7267,"15,4",15.400101720776469]
["SDIIWeiblich45 bis unter 55 JahreInsgesamtKeine Berufsausbildung",33681,5242,"15,6",15.563670912383836]
["SDIIWeiblich45 bis unter 55 JahreInsgesamtBetriebliche/schulische Ausbildung",9903,1569,"15,8",15.843683732202363]
["SDIIWeiblich45 bis unter 55 JahreInsgesamtAkademische Ausbildung",3604,456,"12,7",12.652608213096558]
["SDIIWeiblich45 bis unter 55 JahreDeutscheInsgesamt",14622,2383,"16,3",16.297360142251403]
["SDIIWeiblich45 bis unter 55 JahreDeutscheKeine Berufsausbildung",7587,1282,"16,9",16.897324370633978]
["SDIIWeiblich45 bis unter 55 JahreDeutscheBetriebliche/schulische Ausbildung",6387,994,"15,6",15.562862063566621]
["SDIIWeiblich45 bis unter 55 JahreDeutscheAkademische Ausbildung",648,107,"16,5",16.512345679012348]
["SDIIWeiblich45 bis unter 55 JahreAusländerInsgesamt",32566,4884,"15,0",14.99723638150218]
["SDIIWeiblich45 bis unter 55 JahreAusländerKeine Berufsausbildung",26094,3960,"15,2",15.175902506323293]
["SDIIWeiblich45 bis unter 55 JahreAusländerBetriebliche/schulische Ausbildung",3516,575,"16,4",16.353811149032992]
["SDIIWeiblich45 bis unter 55 JahreAusländerAkademische Ausbildung",2956,349,"11,8",11.806495263870096]
["SDIIWeiblich55 und älterInsgesamtInsgesamt",34041,6344,"18,6",18.636350283481683]
["SDIIWeiblich55 und älterInsgesamtKeine Berufsausbildung",24483,4444,"18,2",18.151370338602295]
["SDIIWeiblich55 und älterInsgesamtBetriebliche/schulische Ausbildung",7778,1542,"19,8",19.825147852918487]
["SDIIWeiblich55 und älterInsgesamtAkademische Ausbildung",1780,358,"20,1",20.112359550561798]
["SDIIWeiblich55 und älterDeutscheInsgesamt",14178,2606,"18,4",18.380589645930314]
["SDIIWeiblich55 und älterDeutscheKeine Berufsausbildung",7754,1433,"18,5",18.48078411142636]
["SDIIWeiblich55 und älterDeutscheBetriebliche/schulische Ausbildung",5911,1063,"18,0",17.98342074099137]
["SDIIWeiblich55 und älterDeutscheAkademische Ausbildung",513,110,"21,4",21.442495126705651]
["SDIIWeiblich55 und älterAusländerInsgesamt",19863,3738,"18,8",18.818909530282436]
["SDIIWeiblich55 und älterAusländerKeine Berufsausbildung",16729,3011,"18,0",17.998684918405164]
["SDIIWeiblich55 und älterAusländerBetriebliche/schulische Ausbildung",1867,479,"25,7",25.6561328334226]
["SDIIWeiblich55 und älterAusländerAkademische Ausbildung",1267,248,"19,6",19.573796369376481]
["SWDInsgesamtInsgesamtInsgesamtInsgesamtInsgesamt",588039,84847,"14,4",14.428804892192524]
["SWDInsgesamtInsgesamtInsgesamtInsgesamtKeine Berufsausbildung",341885,54390,"15,9",15.908858241806456]
["SWDInsgesamtInsgesamtInsgesamtInsgesamtBetriebliche/schulische Ausbildung",186118,24637,"13,2",13.23730106706498]
["SWDInsgesamtInsgesamtInsgesamtInsgesamtAkademische Ausbildung",60036,5820,"9,7",9.6941834899060559]
["SWDInsgesamtInsgesamtInsgesamtDeutscheInsgesamt",334279,48100,"14,4",14.3891779022912]
["SWDInsgesamtInsgesamtInsgesamtDeutscheKeine Berufsausbildung",139891,23118,"16,5",16.525723599087861]
["SWDInsgesamtInsgesamtInsgesamtDeutscheBetriebliche/schulische Ausbildung",156763,21169,"13,5",13.503824244241308]
["SWDInsgesamtInsgesamtInsgesamtDeutscheAkademische Ausbildung",37625,3813,"10,1",10.13421926910299]
["SWDInsgesamtInsgesamtInsgesamtAusländerInsgesamt",253755,36747,"14,5",14.481291009044156]
["SWDInsgesamtInsgesamtInsgesamtAusländerKeine Berufsausbildung",201990,31272,"15,5",15.481954552205554]
["SWDInsgesamtInsgesamtInsgesamtAusländerBetriebliche/schulische Ausbildung",29354,3468,"11,8",11.814403488451317]
["SWDInsgesamtInsgesamtInsgesamtAusländerAkademische Ausbildung",22411,2007,"9,0",8.9554236758734564]
["SWDInsgesamtInsgesamt15 bis unter 25 JahreInsgesamtInsgesamt",98114,6972,"7,1",7.1060195283038103]
["SWDInsgesamtInsgesamt15 bis unter 25 JahreInsgesamtKeine Berufsausbildung",72181,6182,"8,6",8.5645807068342084]
["SWDInsgesamtInsgesamt15 bis unter 25 JahreInsgesamtBetriebliche/schulische Ausbildung",24278,744,"3,1",3.0645028420792486]
["SWDInsgesamtInsgesamt15 bis unter 25 JahreInsgesamtAkademische Ausbildung",1655,46,"2,8",2.7794561933534743]
["SWDInsgesamtInsgesamt15 bis unter 25 JahreDeutscheInsgesamt",59959,3867,"6,4",6.4494070948481461]
["SWDInsgesamtInsgesamt15 bis unter 25 JahreDeutscheKeine Berufsausbildung",37975,3252,"8,6",8.5635286372613564]
["SWDInsgesamtInsgesamt15 bis unter 25 JahreDeutscheBetriebliche/schulische Ausbildung",20961,601,"2,9",2.8672296169075904]
["SWDInsgesamtInsgesamt15 bis unter 25 JahreDeutscheAkademische Ausbildung",1023,14,"1,4",1.3685239491691104]
["SWDInsgesamtInsgesamt15 bis unter 25 JahreAusländerInsgesamt",38153,3105,"8,1",8.1382853248761577]
["SWDInsgesamtInsgesamt15 bis unter 25 JahreAusländerKeine Berufsausbildung",34205,2930,"8,6",8.5659991229352439]
["SWDInsgesamtInsgesamt15 bis unter 25 JahreAusländerBetriebliche/schulische Ausbildung",3316,143,"4,3",4.3124246079613995]
["SWDInsgesamtInsgesamt15 bis unter 25 JahreAusländerAkademische Ausbildung",632,32,"5,1",5.0632911392405067]
["SWDInsgesamtInsgesamt25 bis unter 35 JahreInsgesamtInsgesamt",160152,19389,"12,1",12.106623707477896]
["SWDInsgesamtInsgesamt25 bis unter 35 JahreInsgesamtKeine Berufsausbildung",90482,14210,"15,7",15.704781061426582]
["SWDInsgesamtInsgesamt25 bis unter 35 JahreInsgesamtBetriebliche/schulische Ausbildung",47422,4080,"8,6",8.6036017038505328]
["SWDInsgesamtInsgesamt25 bis unter 35 JahreInsgesamtAkademische Ausbildung",22248,1099,"4,9",4.9397698669543324]
["SWDInsgesamtInsgesamt25 bis unter 35 JahreDeutscheInsgesamt",87129,9898,"11,4",11.36016710854021]
["SWDInsgesamtInsgesamt25 bis unter 35 JahreDeutscheKeine Berufsausbildung",33958,5994,"17,7",17.65121620825726]
["SWDInsgesamtInsgesamt25 bis unter 35 JahreDeutscheBetriebliche/schulische Ausbildung",38991,3323,"8,5",8.5224795465620264]
["SWDInsgesamtInsgesamt25 bis unter 35 JahreDeutscheAkademische Ausbildung",14180,581,"4,1",4.0973201692524688]
["SWDInsgesamtInsgesamt25 bis unter 35 JahreAusländerInsgesamt",73023,9491,"13,0",12.997274831217561]
["SWDInsgesamtInsgesamt25 bis unter 35 JahreAusländerKeine Berufsausbildung",56524,8216,"14,5",14.535418583256671]
["SWDInsgesamtInsgesamt25 bis unter 35 JahreAusländerBetriebliche/schulische Ausbildung",8431,757,"9,0",8.978768829320364]
["SWDInsgesamtInsgesamt25 bis unter 35 JahreAusländerAkademische Ausbildung",8068,518,"6,4",6.4204263758056515]
["SWDInsgesamtInsgesamt35 bis unter 45 JahreInsgesamtInsgesamt",136870,20055,"14,7",14.652590048951561]
["SWDInsgesamtInsgesamt35 bis unter 45 JahreInsgesamtKeine Berufsausbildung",79320,13757,"17,3",17.343671205244579]
["SWDInsgesamtInsgesamt35 bis unter 45 JahreInsgesamtBetriebliche/schulische Ausbildung",39709,4813,"12,1",12.120677931954972]
["SWDInsgesamtInsgesamt35 bis unter 45 JahreInsgesamtAkademische Ausbildung",17841,1485,"8,3",8.3235244661173695]
["SWDInsgesamtInsgesamt35 bis unter 45 JahreDeutscheInsgesamt",66540,9296,"14,0",13.970544033663963]
["SWDInsgesamtInsgesamt35 bis unter 45 JahreDeutscheKeine Berufsausbildung",25174,4753,"18,9",18.880591086041154]
["SWDInsgesamtInsgesamt35 bis unter 45 JahreDeutscheBetriebliche/schulische Ausbildung",31867,3823,"12,0",11.996736435811341]
["SWDInsgesamtInsgesamt35 bis unter 45 JahreDeutscheAkademische Ausbildung",9499,720,"7,6",7.5797452363406679]
["SWDInsgesamtInsgesamt35 bis unter 45 JahreAusländerInsgesamt",70327,10759,"15,3",15.298533991212478]
["SWDInsgesamtInsgesamt35 bis unter 45 JahreAusländerKeine Berufsausbildung",54143,9004,"16,6",16.630035276951777]
["SWDInsgesamtInsgesamt35 bis unter 45 JahreAusländerBetriebliche/schulische Ausbildung",7842,990,"12,6",12.624330527926549]
["SWDInsgesamtInsgesamt35 bis unter 45 JahreAusländerAkademische Ausbildung",8342,765,"9,2",9.1704627187724768]
["SWDInsgesamtInsgesamt45 bis unter 55 JahreInsgesamtInsgesamt",102643,15895,"15,5",15.485712615570471]
["SWDInsgesamtInsgesamt45 bis unter 55 JahreInsgesamtKeine Berufsausbildung",56819,10144,"17,9",17.853182914166034]
["SWDInsgesamtInsgesamt45 bis unter 55 JahreInsgesamtBetriebliche/schulische Ausbildung",36261,4731,"13,0",13.047075370232481]
["SWDInsgesamtInsgesamt45 bis unter 55 JahreInsgesamtAkademische Ausbildung",9563,1020,"10,7",10.666108961622921]
["SWDInsgesamtInsgesamt45 bis unter 55 JahreDeutscheInsgesamt",56167,8000,"14,2",14.243238912528708]
["SWDInsgesamtInsgesamt45 bis unter 55 JahreDeutscheKeine Berufsausbildung",20362,3532,"17,3",17.346036735094785]
["SWDInsgesamtInsgesamt45 bis unter 55 JahreDeutscheBetriebliche/schulische Ausbildung",29943,3842,"12,8",12.831045653408143]
["SWDInsgesamtInsgesamt45 bis unter 55 JahreDeutscheAkademische Ausbildung",5862,626,"10,7",10.678949164107813]
["SWDInsgesamtInsgesamt45 bis unter 55 JahreAusländerInsgesamt",46476,7895,"17,0",16.987262242878046]
["SWDInsgesamtInsgesamt45 bis unter 55 JahreAusländerKeine Berufsausbildung",36457,6612,"18,1",18.136434703897741]
["SWDInsgesamtInsgesamt45 bis unter 55 JahreAusländerBetriebliche/schulische Ausbildung",6318,889,"14,1",14.07090851535296]
["SWDInsgesamtInsgesamt45 bis unter 55 JahreAusländerAkademische Ausbildung",3701,394,"10,6",10.645771413131586]
["SWDInsgesamtInsgesamt55 und älterInsgesamtInsgesamt",90260,22536,"25,0",24.967870596055839]
["SWDInsgesamtInsgesamt55 und älterInsgesamtKeine Berufsausbildung",43083,10097,"23,4",23.436158113409]
["SWDInsgesamtInsgesamt55 und älterInsgesamtBetriebliche/schulische Ausbildung",38448,10269,"26,7",26.70880149812734]
["SWDInsgesamtInsgesamt55 und älterInsgesamtAkademische Ausbildung",8729,2170,"24,9",24.859663191659983]
["SWDInsgesamtInsgesamt55 und älterDeutscheInsgesamt",64484,17039,"26,4",26.423608957260715]
["SWDInsgesamtInsgesamt55 und älterDeutscheKeine Berufsausbildung",22422,5587,"24,9",24.917491749174918]
["SWDInsgesamtInsgesamt55 und älterDeutscheBetriebliche/schulische Ausbildung",35001,9580,"27,4",27.37064655295563]
["SWDInsgesamtInsgesamt55 und älterDeutscheAkademische Ausbildung",7061,1872,"26,5",26.511825520464523]
["SWDInsgesamtInsgesamt55 und älterAusländerInsgesamt",25776,5497,"21,3",21.326039726877717]
["SWDInsgesamtInsgesamt55 und älterAusländerKeine Berufsausbildung",20661,4510,"21,8",21.82856589710082]
["SWDInsgesamtInsgesamt55 und älterAusländerBetriebliche/schulische Ausbildung",3447,689,"20,0",19.988395706411371]
["SWDInsgesamtInsgesamt55 und älterAusländerAkademische Ausbildung",1668,298,"17,9",17.865707434052759]
["SWDInsgesamtMännlichInsgesamtInsgesamtInsgesamt",309187,44504,"14,4",14.393878138472834]
["SWDInsgesamtMännlichInsgesamtInsgesamtKeine Berufsausbildung",179902,27272,"15,2",15.15936454291781]
["SWDInsgesamtMännlichInsgesamtInsgesamtBetriebliche/schulische Ausbildung",102102,14155,"13,9",13.863587392999158]
["SWDInsgesamtMännlichInsgesamtInsgesamtAkademische Ausbildung",27183,3077,"11,3",11.31957473420888]
["SWDInsgesamtMännlichInsgesamtDeutscheInsgesamt",182937,27544,"15,1",15.056549522513215]
["SWDInsgesamtMännlichInsgesamtDeutscheKeine Berufsausbildung",78145,12827,"16,4",16.414357924371362]
["SWDInsgesamtMännlichInsgesamtDeutscheBetriebliche/schulische Ausbildung",86332,12418,"14,4",14.384005930593521]
["SWDInsgesamtMännlichInsgesamtDeutscheAkademische Ausbildung",18460,2299,"12,5",12.453954496208016]
["SWDInsgesamtMännlichInsgesamtAusländerInsgesamt",126247,16960,"13,4",13.4339825896853]
["SWDInsgesamtMännlichInsgesamtAusländerKeine Berufsausbildung",101755,14445,"14,2",14.195862611173899]
["SWDInsgesamtMännlichInsgesamtAusländerBetriebliche/schulische Ausbildung",15769,1737,"11,0",11.015283150485129]
["SWDInsgesamtMännlichInsgesamtAusländerAkademische Ausbildung",8723,778,"8,9",8.9189499025564594]
["SWDInsgesamtMännlich15 bis unter 25 JahreInsgesamtInsgesamt",55979,3991,"7,1",7.1294592615087806]
["SWDInsgesamtMännlich15 bis unter 25 JahreInsgesamtKeine Berufsausbildung",41648,3546,"8,5",8.51421436803688]
["SWDInsgesamtMännlich15 bis unter 25 JahreInsgesamtBetriebliche/schulische Ausbildung",13801,427,"3,1",3.0939786971958552]
["SWDInsgesamtMännlich15 bis unter 25 JahreInsgesamtAkademische Ausbildung",530,18,"3,4",3.3962264150943398]
["SWDInsgesamtMännlich15 bis unter 25 JahreDeutscheInsgesamt",34256,2216,"6,5",6.4689397477814108]
["SWDInsgesamtMännlich15 bis unter 25 JahreDeutscheKeine Berufsausbildung",21990,1869,"8,5",8.4993178717598905]
["SWDInsgesamtMännlich15 bis unter 25 JahreDeutscheBetriebliche/schulische Ausbildung",11896,338,"2,8",2.8412911903160727]
["SWDInsgesamtMännlich15 bis unter 25 JahreDeutscheAkademische Ausbildung",370,9,"2,4",2.4324324324324325]
["SWDInsgesamtMännlich15 bis unter 25 JahreAusländerInsgesamt",21722,1775,"8,2",8.171439094006077]
["SWDInsgesamtMännlich15 bis unter 25 JahreAusländerKeine Berufsausbildung",19658,1677,"8,5",8.5308780140400859]
["SWDInsgesamtMännlich15 bis unter 25 JahreAusländerBetriebliche/schulische Ausbildung",1904,89,"4,7",4.6743697478991599]
["SWDInsgesamtMännlich15 bis unter 25 JahreAusländerAkademische Ausbildung",160,9,"5,6",5.625]
["SWDInsgesamtMännlich25 bis unter 35 JahreInsgesamtInsgesamt",87476,10119,"11,6",11.567744295578215]
["SWDInsgesamtMännlich25 bis unter 35 JahreInsgesamtKeine Berufsausbildung",50968,7454,"14,6",14.624862658923247]
["SWDInsgesamtMännlich25 bis unter 35 JahreInsgesamtBetriebliche/schulische Ausbildung",26937,2202,"8,2",8.1746296915023944]
["SWDInsgesamtMännlich25 bis unter 35 JahreInsgesamtAkademische Ausbildung",9571,463,"4,8",4.8375300386584472]
["SWDInsgesamtMännlich25 bis unter 35 JahreDeutscheInsgesamt",48556,5500,"11,3",11.327127440481094]
["SWDInsgesamtMännlich25 bis unter 35 JahreDeutscheKeine Berufsausbildung",20135,3405,"16,9",16.910851750682891]
["SWDInsgesamtMännlich25 bis unter 35 JahreDeutscheBetriebliche/schulische Ausbildung",22096,1816,"8,2",8.2186821144098481]
["SWDInsgesamtMännlich25 bis unter 35 JahreDeutscheAkademische Ausbildung",6325,279,"4,4",4.4110671936758896]
["SWDInsgesamtMännlich25 bis unter 35 JahreAusländerInsgesamt",38920,4619,"11,9",11.867934224049332]
["SWDInsgesamtMännlich25 bis unter 35 JahreAusländerKeine Berufsausbildung",30833,4049,"13,1",13.132033859825512]
["SWDInsgesamtMännlich25 bis unter 35 JahreAusländerBetriebliche/schulische Ausbildung",4841,386,"8,0",7.9735591819871932]
["SWDInsgesamtMännlich25 bis unter 35 JahreAusländerAkademische Ausbildung",3246,184,"5,7",5.6685150955021566]
["SWDInsgesamtMännlich35 bis unter 45 JahreInsgesamtInsgesamt",67526,9758,"14,5",14.450730089150845]
["SWDInsgesamtMännlich35 bis unter 45 JahreInsgesamtKeine Berufsausbildung",38764,6457,"16,7",16.657207718501702]
["SWDInsgesamtMännlich35 bis unter 45 JahreInsgesamtBetriebliche/schulische Ausbildung",21274,2657,"12,5",12.489423709692582]
["SWDInsgesamtMännlich35 bis unter 45 JahreInsgesamtAkademische Ausbildung",7488,644,"8,6",8.600427350427351]
["SWDInsgesamtMännlich35 bis unter 45 JahreDeutscheInsgesamt",35597,5164,"14,5",14.506840464084053]
["SWDInsgesamtMännlich35 bis unter 45 JahreDeutscheKeine Berufsausbildung",13966,2623,"18,8",18.78132607761707]
["SWDInsgesamtMännlich35 bis unter 45 JahreDeutscheBetriebliche/schulische Ausbildung",17280,2192,"12,7",12.685185185185185]
["SWDInsgesamtMännlich35 bis unter 45 JahreDeutscheAkademische Ausbildung",4351,349,"8,0",8.0211445644679387]
["SWDInsgesamtMännlich35 bis unter 45 JahreAusländerInsgesamt",31927,4594,"14,4",14.389075077520594]
["SWDInsgesamtMännlich35 bis unter 45 JahreAusländerKeine Berufsausbildung",24796,3834,"15,5",15.46217131795451]
["SWDInsgesamtMännlich35 bis unter 45 JahreAusländerBetriebliche/schulische Ausbildung",3994,465,"11,6",11.642463695543315]
["SWDInsgesamtMännlich35 bis unter 45 JahreAusländerAkademische Ausbildung",3137,295,"9,4",9.4038890659866112]
["SWDInsgesamtMännlich45 bis unter 55 JahreInsgesamtInsgesamt",50532,8004,"15,8",15.839468059843268]
["SWDInsgesamtMännlich45 bis unter 55 JahreInsgesamtKeine Berufsausbildung",27188,4766,"17,5",17.52979255553921]
["SWDInsgesamtMännlich45 bis unter 55 JahreInsgesamtBetriebliche/schulische Ausbildung",18910,2714,"14,4",14.352194606028556]
["SWDInsgesamtMännlich45 bis unter 55 JahreInsgesamtAkademische Ausbildung",4434,524,"11,8",11.817771763644565]
["SWDInsgesamtMännlich45 bis unter 55 JahreDeutscheInsgesamt",29254,4593,"15,7",15.700417036986394]
["SWDInsgesamtMännlich45 bis unter 55 JahreDeutscheKeine Berufsausbildung",10489,1938,"18,5",18.47649918962723]
["SWDInsgesamtMännlich45 bis unter 55 JahreDeutscheBetriebliche/schulische Ausbildung",15725,2282,"14,5",14.511923688394276]
["SWDInsgesamtMännlich45 bis unter 55 JahreDeutscheAkademische Ausbildung",3040,373,"12,3",12.269736842105264]
["SWDInsgesamtMännlich45 bis unter 55 JahreAusländerInsgesamt",21278,3411,"16,0",16.030641977629475]
["SWDInsgesamtMännlich45 bis unter 55 JahreAusländerKeine Berufsausbildung",16699,2828,"16,9",16.935145817114797]
["SWDInsgesamtMännlich45 bis unter 55 JahreAusländerBetriebliche/schulische Ausbildung",3185,432,"13,6",13.563579277864992]
["SWDInsgesamtMännlich45 bis unter 55 JahreAusländerAkademische Ausbildung",1394,151,"10,8",10.832137733142037]
["SWDInsgesamtMännlich55 und älterInsgesamtInsgesamt",47674,12632,"26,5",26.496622897176657]
["SWDInsgesamtMännlich55 und älterInsgesamtKeine Berufsausbildung",21334,5049,"23,7",23.666447923502389]
["SWDInsgesamtMännlich55 und älterInsgesamtBetriebliche/schulische Ausbildung",21180,6155,"29,1",29.060434372049105]
["SWDInsgesamtMännlich55 und älterInsgesamtAkademische Ausbildung",5160,1428,"27,7",27.674418604651162]
["SWDInsgesamtMännlich55 und älterDeutscheInsgesamt",35274,10071,"28,6",28.550773941146453]
["SWDInsgesamtMännlich55 und älterDeutscheKeine Berufsausbildung",11565,2992,"25,9",25.871162991785564]
["SWDInsgesamtMännlich55 und älterDeutscheBetriebliche/schulische Ausbildung",19335,5790,"29,9",29.945694336695112]
["SWDInsgesamtMännlich55 und älterDeutscheAkademische Ausbildung",4374,1289,"29,5",29.469593049839965]
["SWDInsgesamtMännlich55 und älterAusländerInsgesamt",12400,2561,"20,7",20.653225806451616]
["SWDInsgesamtMännlich55 und älterAusländerKeine Berufsausbildung",9769,2057,"21,1",21.056402907155285]
["SWDInsgesamtMännlich55 und älterAusländerBetriebliche/schulische Ausbildung",1845,365,"19,8",19.78319783197832]
["SWDInsgesamtMännlich55 und älterAusländerAkademische Ausbildung",786,139,"17,7",17.684478371501271]
["SWDInsgesamtWeiblichInsgesamtInsgesamtInsgesamt",278846,40343,"14,5",14.467842465016531]
["SWDInsgesamtWeiblichInsgesamtInsgesamtKeine Berufsausbildung",161979,27118,"16,7",16.74167639014934]
["SWDInsgesamtWeiblichInsgesamtInsgesamtBetriebliche/schulische Ausbildung",84016,10482,"12,5",12.476195010474195]
["SWDInsgesamtWeiblichInsgesamtInsgesamtAkademische Ausbildung",32851,2743,"8,3",8.3498219232291255]
["SWDInsgesamtWeiblichInsgesamtDeutscheInsgesamt",151340,20556,"13,6",13.582661556759614]
["SWDInsgesamtWeiblichInsgesamtDeutscheKeine Berufsausbildung",61744,10291,"16,7",16.667206530189169]
["SWDInsgesamtWeiblichInsgesamtDeutscheBetriebliche/schulische Ausbildung",70431,8751,"12,4",12.424926523831834]
["SWDInsgesamtWeiblichInsgesamtDeutscheAkademische Ausbildung",19165,1514,"7,9",7.8998173754239494]
["SWDInsgesamtWeiblichInsgesamtAusländerInsgesamt",127504,19787,"15,5",15.518728824193751]
["SWDInsgesamtWeiblichInsgesamtAusländerKeine Berufsausbildung",100233,16827,"16,8",16.787884229744694]
["SWDInsgesamtWeiblichInsgesamtAusländerBetriebliche/schulische Ausbildung",13585,1731,"12,7",12.741994847258006]
["SWDInsgesamtWeiblichInsgesamtAusländerAkademische Ausbildung",13686,1229,"9,0",8.9799795411369292]
["SWDInsgesamtWeiblich15 bis unter 25 JahreInsgesamtInsgesamt",42133,2981,"7,1",7.0752142026440072]
["SWDInsgesamtWeiblich15 bis unter 25 JahreInsgesamtKeine Berufsausbildung",30532,2636,"8,6",8.6335647844884047]
["SWDInsgesamtWeiblich15 bis unter 25 JahreInsgesamtBetriebliche/schulische Ausbildung",10477,317,"3,0",3.0256752887276894]
["SWDInsgesamtWeiblich15 bis unter 25 JahreInsgesamtAkademische Ausbildung",1124,28,"2,5",2.4911032028469751]
["SWDInsgesamtWeiblich15 bis unter 25 JahreDeutscheInsgesamt",25703,1651,"6,4",6.4233747033420219]
["SWDInsgesamtWeiblich15 bis unter 25 JahreDeutscheKeine Berufsausbildung",15985,1383,"8,7",8.651861119799813]
["SWDInsgesamtWeiblich15 bis unter 25 JahreDeutscheBetriebliche/schulische Ausbildung",9065,263,"2,9",2.9012686155543301]
["SWDInsgesamtWeiblich15 bis unter 25 JahreDeutscheAkademische Ausbildung",653,5,"0,8",0.76569678407350694]
["SWDInsgesamtWeiblich15 bis unter 25 JahreAusländerInsgesamt",16429,1330,"8,1",8.0954409884959535]
["SWDInsgesamtWeiblich15 bis unter 25 JahreAusländerKeine Berufsausbildung",14546,1253,"8,6",8.6140519730510103]
["SWDInsgesamtWeiblich15 bis unter 25 JahreAusländerBetriebliche/schulische Ausbildung",1412,54,"3,8",3.8243626062322948]
["SWDInsgesamtWeiblich15 bis unter 25 JahreAusländerAkademische Ausbildung",471,23,"4,9",4.8832271762208075]
["SWDInsgesamtWeiblich25 bis unter 35 JahreInsgesamtInsgesamt",72675,9270,"12,8",12.755417956656348]
["SWDInsgesamtWeiblich25 bis unter 35 JahreInsgesamtKeine Berufsausbildung",39513,6756,"17,1",17.098170222458432]
["SWDInsgesamtWeiblich25 bis unter 35 JahreInsgesamtBetriebliche/schulische Ausbildung",20485,1878,"9,2",9.1676836709787644]
["SWDInsgesamtWeiblich25 bis unter 35 JahreInsgesamtAkademische Ausbildung",12677,636,"5,0",5.0169598485446079]
["SWDInsgesamtWeiblich25 bis unter 35 JahreDeutscheInsgesamt",38572,4398,"11,4",11.40205330291403]
["SWDInsgesamtWeiblich25 bis unter 35 JahreDeutscheKeine Berufsausbildung",13822,2589,"18,7",18.731008537114743]
["SWDInsgesamtWeiblich25 bis unter 35 JahreDeutscheBetriebliche/schulische Ausbildung",16895,1507,"8,9",8.9197987570287083]
["SWDInsgesamtWeiblich25 bis unter 35 JahreDeutscheAkademische Ausbildung",7855,302,"3,8",3.8446849140674728]
["SWDInsgesamtWeiblich25 bis unter 35 JahreAusländerInsgesamt",34103,4872,"14,3",14.286133184763806]
["SWDInsgesamtWeiblich25 bis unter 35 JahreAusländerKeine Berufsausbildung",25691,4167,"16,2",16.219687828422405]
["SWDInsgesamtWeiblich25 bis unter 35 JahreAusländerBetriebliche/schulische Ausbildung",3590,371,"10,3",10.334261838440112]
["SWDInsgesamtWeiblich25 bis unter 35 JahreAusländerAkademische Ausbildung",4822,334,"6,9",6.9265864786395683]
["SWDInsgesamtWeiblich35 bis unter 45 JahreInsgesamtInsgesamt",69342,10297,"14,8",14.849586109428628]
["SWDInsgesamtWeiblich35 bis unter 45 JahreInsgesamtKeine Berufsausbildung",40555,7300,"18,0",18.000246578720255]
["SWDInsgesamtWeiblich35 bis unter 45 JahreInsgesamtBetriebliche/schulische Ausbildung",18435,2156,"11,7",11.695145104420938]
["SWDInsgesamtWeiblich35 bis unter 45 JahreInsgesamtAkademische Ausbildung",10352,841,"8,1",8.1240340030911913]
["SWDInsgesamtWeiblich35 bis unter 45 JahreDeutscheInsgesamt",30943,4132,"13,4",13.353585625181786]
["SWDInsgesamtWeiblich35 bis unter 45 JahreDeutscheKeine Berufsausbildung",11208,2130,"19,0",19.00428265524625]
["SWDInsgesamtWeiblich35 bis unter 45 JahreDeutscheBetriebliche/schulische Ausbildung",14587,1631,"11,2",11.18118872969082]
["SWDInsgesamtWeiblich35 bis unter 45 JahreDeutscheAkademische Ausbildung",5148,371,"7,2",7.2066822066822063]
["SWDInsgesamtWeiblich35 bis unter 45 JahreAusländerInsgesamt",38398,6165,"16,1",16.055523725194021]
["SWDInsgesamtWeiblich35 bis unter 45 JahreAusländerKeine Berufsausbildung",29346,5170,"17,6",17.617392489606761]
["SWDInsgesamtWeiblich35 bis unter 45 JahreAusländerBetriebliche/schulische Ausbildung",3848,525,"13,6",13.643451143451143]
["SWDInsgesamtWeiblich35 bis unter 45 JahreAusländerAkademische Ausbildung",5204,470,"9,0",9.0315142198308997]
["SWDInsgesamtWeiblich45 bis unter 55 JahreInsgesamtInsgesamt",52110,7891,"15,1",15.14296680099789]
["SWDInsgesamtWeiblich45 bis unter 55 JahreInsgesamtKeine Berufsausbildung",29630,5378,"18,2",18.15052311846102]
["SWDInsgesamtWeiblich45 bis unter 55 JahreInsgesamtBetriebliche/schulische Ausbildung",17351,2017,"11,6",11.624690219583886]
["SWDInsgesamtWeiblich45 bis unter 55 JahreInsgesamtAkademische Ausbildung",5129,496,"9,7",9.6705010723337885]
["SWDInsgesamtWeiblich45 bis unter 55 JahreDeutscheInsgesamt",26912,3407,"12,7",12.659780023781215]
["SWDInsgesamtWeiblich45 bis unter 55 JahreDeutscheKeine Berufsausbildung",9872,1594,"16,1",16.146677471636952]
["SWDInsgesamtWeiblich45 bis unter 55 JahreDeutscheBetriebliche/schulische Ausbildung",14218,1560,"11,0",10.972007314671544]
["SWDInsgesamtWeiblich45 bis unter 55 JahreDeutscheAkademische Ausbildung",2822,253,"9,0",8.9652728561304045]
["SWDInsgesamtWeiblich45 bis unter 55 JahreAusländerInsgesamt",25198,4484,"17,8",17.79506310024605]
["SWDInsgesamtWeiblich45 bis unter 55 JahreAusländerKeine Berufsausbildung",19758,3784,"19,2",19.151736005668589]
["SWDInsgesamtWeiblich45 bis unter 55 JahreAusländerBetriebliche/schulische Ausbildung",3133,457,"14,6",14.586658155122887]
["SWDInsgesamtWeiblich45 bis unter 55 JahreAusländerAkademische Ausbildung",2307,243,"10,5",10.533159947984396]
["SWDInsgesamtWeiblich55 und älterInsgesamtInsgesamt",42586,9904,"23,3",23.256469262198845]
["SWDInsgesamtWeiblich55 und älterInsgesamtKeine Berufsausbildung",21749,5048,"23,2",23.210262540806472]
["SWDInsgesamtWeiblich55 und älterInsgesamtBetriebliche/schulische Ausbildung",17268,4114,"23,8",23.824415103080842]
["SWDInsgesamtWeiblich55 und älterInsgesamtAkademische Ausbildung",3569,742,"20,8",20.790137293359486]
["SWDInsgesamtWeiblich55 und älterDeutscheInsgesamt",29210,6968,"23,9",23.854844231427595]
["SWDInsgesamtWeiblich55 und älterDeutscheKeine Berufsausbildung",10857,2595,"23,9",23.901630284609006]
["SWDInsgesamtWeiblich55 und älterDeutscheBetriebliche/schulische Ausbildung",15666,3790,"24,2",24.192518830588536]
["SWDInsgesamtWeiblich55 und älterDeutscheAkademische Ausbildung",2687,583,"21,7",21.697059918124303]
["SWDInsgesamtWeiblich55 und älterAusländerInsgesamt",13376,2936,"21,9",21.949760765550238]
["SWDInsgesamtWeiblich55 und älterAusländerKeine Berufsausbildung",10892,2453,"22,5",22.521116415717959]
["SWDInsgesamtWeiblich55 und älterAusländerBetriebliche/schulische Ausbildung",1602,324,"20,2",20.224719101123593]
["SWDInsgesamtWeiblich55 und älterAusländerAkademische Ausbildung",882,159,"18,0",18.027210884353742]
["SWDIIIInsgesamtInsgesamtInsgesamtInsgesamt",296444,29052,"9,8",9.8001646179379573]
["SWDIIIInsgesamtInsgesamtInsgesamtKeine Berufsausbildung",113483,10986,"9,7",9.6807451336323496]
["SWDIIIInsgesamtInsgesamtInsgesamtBetriebliche/schulische Ausbildung",139457,14411,"10,3",10.33365123299655]
["SWDIIIInsgesamtInsgesamtInsgesamtAkademische Ausbildung",43504,3655,"8,4",8.401526296432511]
["SWDIIIInsgesamtInsgesamtDeutscheInsgesamt",218141,22972,"10,5",10.530803471149394]
["SWDIIIInsgesamtInsgesamtDeutscheKeine Berufsausbildung",63537,6804,"10,7",10.708720902781057]
["SWDIIIInsgesamtInsgesamtDeutscheBetriebliche/schulische Ausbildung",121477,13155,"10,8",10.829210467825185]
["SWDIIIInsgesamtInsgesamtDeutscheAkademische Ausbildung",33127,3013,"9,1",9.0952999064207436]
["SWDIIIInsgesamtInsgesamtAusländerInsgesamt",78303,6080,"7,8",7.7647088872712402]
["SWDIIIInsgesamtInsgesamtAusländerKeine Berufsausbildung",49946,4182,"8,4",8.3730428863172222]
["SWDIIIInsgesamtInsgesamtAusländerBetriebliche/schulische Ausbildung",17980,1256,"7,0",6.985539488320355]
["SWDIIIInsgesamtInsgesamtAusländerAkademische Ausbildung",10377,642,"6,2",6.1867591789534551]
["SWDIIIInsgesamt15 bis unter 25 JahreInsgesamtInsgesamt",47843,1421,"3,0",2.9701314716886484]
["SWDIIIInsgesamt15 bis unter 25 JahreInsgesamtKeine Berufsausbildung",24440,889,"3,6",3.6374795417348609]
["SWDIIIInsgesamt15 bis unter 25 JahreInsgesamtBetriebliche/schulische Ausbildung",22354,520,"2,3",2.3262056007873313]
["SWDIIIInsgesamt15 bis unter 25 JahreInsgesamtAkademische Ausbildung",1049,12,"1,1",1.1439466158245948]
["SWDIIIInsgesamt15 bis unter 25 JahreDeutscheInsgesamt",38330,1055,"2,8",2.7524132533263761]
["SWDIIIInsgesamt15 bis unter 25 JahreDeutscheKeine Berufsausbildung",17682,606,"3,4",3.4272141160502207]
["SWDIIIInsgesamt15 bis unter 25 JahreDeutscheBetriebliche/schulische Ausbildung",19744,442,"2,2",2.2386547811993518]
["SWDIIIInsgesamt15 bis unter 25 JahreDeutscheAkademische Ausbildung",904,7,"0,8",0.77433628318584069]
["SWDIIIInsgesamt15 bis unter 25 JahreAusländerInsgesamt",9513,366,"3,8",3.8473667612740456]
["SWDIIIInsgesamt15 bis unter 25 JahreAusländerKeine Berufsausbildung",6758,283,"4,2",4.187629476176383]
["SWDIIIInsgesamt15 bis unter 25 JahreAusländerBetriebliche/schulische Ausbildung",2610,78,"3,0",2.9885057471264367]
["SWDIIIInsgesamt15 bis unter 25 JahreAusländerAkademische Ausbildung",145,5,"3,4",3.4482758620689653]
["SWDIIIInsgesamt25 bis unter 35 JahreInsgesamtInsgesamt",83441,4603,"5,5",5.5164727172493144]
["SWDIIIInsgesamt25 bis unter 35 JahreInsgesamtKeine Berufsausbildung",29908,2159,"7,2",7.2188043332887517]
["SWDIIIInsgesamt25 bis unter 35 JahreInsgesamtBetriebliche/schulische Ausbildung",36681,1871,"5,1",5.1007333496905751]
["SWDIIIInsgesamt25 bis unter 35 JahreInsgesamtAkademische Ausbildung",16852,573,"3,4",3.4001898884405413]
["SWDIIIInsgesamt25 bis unter 35 JahreDeutscheInsgesamt",57316,3054,"5,3",5.3283550840951914]
["SWDIIIInsgesamt25 bis unter 35 JahreDeutscheKeine Berufsausbildung",14004,1072,"7,7",7.6549557269351611]
["SWDIIIInsgesamt25 bis unter 35 JahreDeutscheBetriebliche/schulische Ausbildung",30948,1591,"5,1",5.1408814786092796]
["SWDIIIInsgesamt25 bis unter 35 JahreDeutscheAkademische Ausbildung",12364,391,"3,2",3.1624069880297636]
["SWDIIIInsgesamt25 bis unter 35 JahreAusländerInsgesamt",26125,1549,"5,9",5.9291866028708133]
["SWDIIIInsgesamt25 bis unter 35 JahreAusländerKeine Berufsausbildung",15904,1087,"6,8",6.8347585513078473]
["SWDIIIInsgesamt25 bis unter 35 JahreAusländerBetriebliche/schulische Ausbildung",5733,280,"4,9",4.8840048840048844]
["SWDIIIInsgesamt25 bis unter 35 JahreAusländerAkademische Ausbildung",4488,182,"4,1",4.0552584670231724]
["SWDIIIInsgesamt35 bis unter 45 JahreInsgesamtInsgesamt",61065,4460,"7,3",7.3036927863751737]
["SWDIIIInsgesamt35 bis unter 45 JahreInsgesamtKeine Berufsausbildung",22334,1854,"8,3",8.3012447389630157]
["SWDIIIInsgesamt35 bis unter 45 JahreInsgesamtBetriebliche/schulische Ausbildung",26754,1871,"7,0",6.9933467892651562]
["SWDIIIInsgesamt35 bis unter 45 JahreInsgesamtAkademische Ausbildung",11977,735,"6,1",6.1367621274108703]
["SWDIIIInsgesamt35 bis unter 45 JahreDeutscheInsgesamt",40997,2951,"7,2",7.1980876649510943]
["SWDIIIInsgesamt35 bis unter 45 JahreDeutscheKeine Berufsausbildung",10206,896,"8,8",8.7791495198902592]
["SWDIIIInsgesamt35 bis unter 45 JahreDeutscheBetriebliche/schulische Ausbildung",22421,1560,"7,0",6.9577628116497925]
["SWDIIIInsgesamt35 bis unter 45 JahreDeutscheAkademische Ausbildung",8370,495,"5,9",5.913978494623656]
["SWDIIIInsgesamt35 bis unter 45 JahreAusländerInsgesamt",20068,1509,"7,5",7.5194339246561688]
["SWDIIIInsgesamt35 bis unter 45 JahreAusländerKeine Berufsausbildung",12128,958,"7,9",7.8990765171503954]
["SWDIIIInsgesamt35 bis unter 45 JahreAusländerBetriebliche/schulische Ausbildung",4333,311,"7,2",7.1774751903992611]
["SWDIIIInsgesamt35 bis unter 45 JahreAusländerAkademische Ausbildung",3607,240,"6,7",6.6537288605489326]
["SWDIIIInsgesamt45 bis unter 55 JahreInsgesamtInsgesamt",49991,4403,"8,8",8.8075853653657674]
["SWDIIIInsgesamt45 bis unter 55 JahreInsgesamtKeine Berufsausbildung",18623,1753,"9,4",9.4130913386672397]
["SWDIIIInsgesamt45 bis unter 55 JahreInsgesamtBetriebliche/schulische Ausbildung",24769,2085,"8,4",8.4177802898784773]
["SWDIIIInsgesamt45 bis unter 55 JahreInsgesamtAkademische Ausbildung",6599,565,"8,6",8.5619033186846494]
["SWDIIIInsgesamt45 bis unter 55 JahreDeutscheInsgesamt",35529,3218,"9,1",9.0573897379605395]
["SWDIIIInsgesamt45 bis unter 55 JahreDeutscheKeine Berufsausbildung",9135,934,"10,2",10.224411603721949]
["SWDIIIInsgesamt45 bis unter 55 JahreDeutscheBetriebliche/schulische Ausbildung",21291,1833,"8,6",8.6092715231788084]
["SWDIIIInsgesamt45 bis unter 55 JahreDeutscheAkademische Ausbildung",5103,451,"8,8",8.8379384675680974]
["SWDIIIInsgesamt45 bis unter 55 JahreAusländerInsgesamt",14462,1185,"8,2",8.1938874291246027]
["SWDIIIInsgesamt45 bis unter 55 JahreAusländerKeine Berufsausbildung",9488,819,"8,6",8.6319561551433388]
["SWDIIIInsgesamt45 bis unter 55 JahreAusländerBetriebliche/schulische Ausbildung",3478,252,"7,2",7.245543415756182]
["SWDIIIInsgesamt45 bis unter 55 JahreAusländerAkademische Ausbildung",1496,114,"7,6",7.6203208556149731]
["SWDIIIInsgesamt55 und älterInsgesamtInsgesamt",54104,14165,"26,2",26.181058701759575]
["SWDIIIInsgesamt55 und älterInsgesamtKeine Berufsausbildung",18178,4331,"23,8",23.825503355704697]
["SWDIIIInsgesamt55 und älterInsgesamtBetriebliche/schulische Ausbildung",28899,8064,"27,9",27.904079725942072]
["SWDIIIInsgesamt55 und älterInsgesamtAkademische Ausbildung",7027,1770,"25,2",25.188558417532374]
["SWDIIIInsgesamt55 und älterDeutscheInsgesamt",45969,12694,"27,6",27.614261785116057]
["SWDIIIInsgesamt55 und älterDeutscheKeine Berufsausbildung",12510,3296,"26,3",26.346922462030374]
["SWDIIIInsgesamt55 und älterDeutscheBetriebliche/schulische Ausbildung",27073,7729,"28,5",28.548738595648803]
["SWDIIIInsgesamt55 und älterDeutscheAkademische Ausbildung",6386,1669,"26,1",26.135295959912309]
["SWDIIIInsgesamt55 und älterAusländerInsgesamt",8135,1471,"18,1",18.082360172095882]
["SWDIIIInsgesamt55 und älterAusländerKeine Berufsausbildung",5668,1035,"18,3",18.260409315455188]
["SWDIIIInsgesamt55 und älterAusländerBetriebliche/schulische Ausbildung",1826,335,"18,3",18.346111719605695]
["SWDIIIInsgesamt55 und älterAusländerAkademische Ausbildung",641,101,"15,8",15.756630265210608]
["SWDIIIMännlichInsgesamtInsgesamtInsgesamt",170771,17288,"10,1",10.123498720508751]
["SWDIIIMännlichInsgesamtInsgesamtKeine Berufsausbildung",73031,6803,"9,3",9.3152223028576913]
["SWDIIIMännlichInsgesamtInsgesamtBetriebliche/schulische Ausbildung",77146,8377,"10,9",10.858631685375782]
["SWDIIIMännlichInsgesamtInsgesamtAkademische Ausbildung",20594,2108,"10,2",10.235991065358842]
["SWDIIIMännlichInsgesamtDeutscheInsgesamt",120677,13486,"11,2",11.175286094284743]
["SWDIIIMännlichInsgesamtDeutscheKeine Berufsausbildung",38147,4004,"10,5",10.496238236296431]
["SWDIIIMännlichInsgesamtDeutscheBetriebliche/schulische Ausbildung",66394,7638,"11,5",11.504051570925084]
["SWDIIIMännlichInsgesamtDeutscheAkademische Ausbildung",16136,1844,"11,4",11.427863163113534]
["SWDIIIMännlichInsgesamtAusländerInsgesamt",50094,3802,"7,6",7.5897313051463247]
["SWDIIIMännlichInsgesamtAusländerKeine Berufsausbildung",34884,2799,"8,0",8.0237358101135197]
["SWDIIIMännlichInsgesamtAusländerBetriebliche/schulische Ausbildung",10752,739,"6,9",6.8731398809523805]
["SWDIIIMännlichInsgesamtAusländerAkademische Ausbildung",4458,264,"5,9",5.9219380888290711]
["SWDIIIMännlich15 bis unter 25 JahreInsgesamtInsgesamt",29457,905,"3,1",3.0722748412940897]
["SWDIIIMännlich15 bis unter 25 JahreInsgesamtKeine Berufsausbildung",16180,590,"3,6",3.6464771322620519]
["SWDIIIMännlich15 bis unter 25 JahreInsgesamtBetriebliche/schulische Ausbildung",12899,309,"2,4",2.3955345375610513]
["SWDIIIMännlich15 bis unter 25 JahreInsgesamtAkademische Ausbildung",378,6,"1,6",1.5873015873015872]
["SWDIIIMännlich15 bis unter 25 JahreDeutscheInsgesamt",22723,636,"2,8",2.7989261981252476]
["SWDIIIMännlich15 bis unter 25 JahreDeutscheKeine Berufsausbildung",11081,375,"3,4",3.3841711036910027]
["SWDIIIMännlich15 bis unter 25 JahreDeutscheBetriebliche/schulische Ausbildung",11314,256,"2,3",2.2626834010959875]
["SWDIIIMännlich15 bis unter 25 JahreDeutscheAkademische Ausbildung","*","*","1,5",1.524390243902439]
["SWDIIIMännlich15 bis unter 25 JahreAusländerInsgesamt",6734,269,"4,0",3.9946539946539947]
["SWDIIIMännlich15 bis unter 25 JahreAusländerKeine Berufsausbildung",5099,215,"4,2",4.2165130417728962]
["SWDIIIMännlich15 bis unter 25 JahreAusländerBetriebliche/schulische Ausbildung",1585,53,"3,3",3.3438485804416405]
["SWDIIIMännlich15 bis unter 25 JahreAusländerAkademische Ausbildung","*","*","k.A.",{"$error":"#N/A"}]
["SWDIIIMännlich25 bis unter 35 JahreInsgesamtInsgesamt",49935,2771,"5,5",5.5492139781716228]
["SWDIIIMännlich25 bis unter 35 JahreInsgesamtKeine Berufsausbildung",21259,1505,"7,1",7.0793546262759302]
["SWDIIIMännlich25 bis unter 35 JahreInsgesamtBetriebliche/schulische Ausbildung",21348,1020,"4,8",4.7779651489600905]
["SWDIIIMännlich25 bis unter 35 JahreInsgesamtAkademische Ausbildung",7328,246,"3,4",3.356986899563319]
["SWDIIIMännlich25 bis unter 35 JahreDeutscheInsgesamt",32461,1723,"5,3",5.3079079510797573]
["SWDIIIMännlich25 bis unter 35 JahreDeutscheKeine Berufsausbildung",9249,695,"7,5",7.5143258730673583]
["SWDIIIMännlich25 bis unter 35 JahreDeutscheBetriebliche/schulische Ausbildung",17765,850,"4,8",4.7846889952153111]
["SWDIIIMännlich25 bis unter 35 JahreDeutscheAkademische Ausbildung","*","*","3,3",3.2678538645125759]
["SWDIIIMännlich25 bis unter 35 JahreAusländerInsgesamt",17474,1048,"6,0",5.9974819732173517]
["SWDIIIMännlich25 bis unter 35 JahreAusländerKeine Berufsausbildung",12010,810,"6,7",6.7443796835970033]
["SWDIIIMännlich25 bis unter 35 JahreAusländerBetriebliche/schulische Ausbildung",3583,170,"4,7",4.74462740720067]
["SWDIIIMännlich25 bis unter 35 JahreAusländerAkademische Ausbildung",1881,68,"3,6",3.6150983519404574]
["SWDIIIMännlich35 bis unter 45 JahreInsgesamtInsgesamt",34415,2620,"7,6",7.6129594653494115]
["SWDIIIMännlich35 bis unter 45 JahreInsgesamtKeine Berufsausbildung",14471,1216,"8,4",8.4030129223965169]
["SWDIIIMännlich35 bis unter 45 JahreInsgesamtBetriebliche/schulische Ausbildung",14630,1078,"7,4",7.3684210526315779]
["SWDIIIMännlich35 bis unter 45 JahreInsgesamtAkademische Ausbildung",5314,326,"6,1",6.1347384267971394]
["SWDIIIMännlich35 bis unter 45 JahreDeutscheInsgesamt",22144,1724,"7,8",7.7854046242774562]
["SWDIIIMännlich35 bis unter 45 JahreDeutscheKeine Berufsausbildung",6224,579,"9,3",9.3026992287917736]
["SWDIIIMännlich35 bis unter 45 JahreDeutscheBetriebliche/schulische Ausbildung",12135,907,"7,5",7.474248042851257]
["SWDIIIMännlich35 bis unter 45 JahreDeutscheAkademische Ausbildung",3785,238,"6,3",6.2879788639365914]
["SWDIIIMännlich35 bis unter 45 JahreAusländerInsgesamt",12271,896,"7,3",7.3017683970336558]
["SWDIIIMännlich35 bis unter 45 JahreAusländerKeine Berufsausbildung",8247,637,"7,7",7.7240208560688739]
["SWDIIIMännlich35 bis unter 45 JahreAusländerBetriebliche/schulische Ausbildung",2495,171,"6,9",6.8537074148296586]
["SWDIIIMännlich35 bis unter 45 JahreAusländerAkademische Ausbildung",1529,88,"5,8",5.755395683453238]
["SWDIIIMännlich45 bis unter 55 JahreInsgesamtInsgesamt",26603,2472,"9,3",9.2921850919069282]
["SWDIIIMännlich45 bis unter 55 JahreInsgesamtKeine Berufsausbildung",10706,1030,"9,6",9.620773398094526]
["SWDIIIMännlich45 bis unter 55 JahreInsgesamtBetriebliche/schulische Ausbildung",12647,1132,"9,0",8.9507393057642126]
["SWDIIIMännlich45 bis unter 55 JahreInsgesamtAkademische Ausbildung",3250,310,"9,5",9.5384615384615383]
["SWDIIIMännlich45 bis unter 55 JahreDeutscheInsgesamt",18169,1811,"10,0",9.9675271066101612]
["SWDIIIMännlich45 bis unter 55 JahreDeutscheKeine Berufsausbildung",4865,548,"11,3",11.264131551901336]
["SWDIIIMännlich45 bis unter 55 JahreDeutscheBetriebliche/schulische Ausbildung",10690,1001,"9,4",9.3638914873713759]
["SWDIIIMännlich45 bis unter 55 JahreDeutscheAkademische Ausbildung",2614,262,"10,0",10.022953328232594]
["SWDIIIMännlich45 bis unter 55 JahreAusländerInsgesamt",8434,661,"7,8",7.8373251126393164]
["SWDIIIMännlich45 bis unter 55 JahreAusländerKeine Berufsausbildung",5841,482,"8,3",8.2520116418421487]
["SWDIIIMännlich45 bis unter 55 JahreAusländerBetriebliche/schulische Ausbildung",1957,131,"6,7",6.6939192641798675]
["SWDIIIMännlich45 bis unter 55 JahreAusländerAkademische Ausbildung",636,48,"7,5",7.5471698113207548]
["SWDIIIMännlich55 und älterInsgesamtInsgesamt",30361,8520,"28,1",28.062316787984585]
["SWDIIIMännlich55 und älterInsgesamtKeine Berufsausbildung",10415,2462,"23,6",23.638982237157947]
["SWDIIIMännlich55 und älterInsgesamtBetriebliche/schulische Ausbildung",15622,4838,"31,0",30.969146076046599]
["SWDIIIMännlich55 und älterInsgesamtAkademische Ausbildung",4324,1220,"28,2",28.214616096207219]
["SWDIIIMännlich55 und älterDeutscheInsgesamt",25180,7592,"30,2",30.150913423351867]
["SWDIIIMännlich55 und älterDeutscheKeine Berufsausbildung",6728,1807,"26,9",26.857907253269918]
["SWDIIIMännlich55 und älterDeutscheBetriebliche/schulische Ausbildung",14490,4624,"31,9",31.911663216011043]
["SWDIIIMännlich55 und älterDeutscheAkademische Ausbildung",3962,1161,"29,3",29.303382130237253]
["SWDIIIMännlich55 und älterAusländerInsgesamt",5181,928,"17,9",17.911600077205172]
["SWDIIIMännlich55 und älterAusländerKeine Berufsausbildung",3687,655,"17,8",17.765120694331436]
["SWDIIIMännlich55 und älterAusländerBetriebliche/schulische Ausbildung",1132,214,"18,9",18.904593639575971]
["SWDIIIMännlich55 und älterAusländerAkademische Ausbildung",362,59,"16,3",16.298342541436465]
["SWDIIIWeiblichInsgesamtInsgesamtInsgesamt",125670,11764,"9,4",9.3610249065011537]
["SWDIIIWeiblichInsgesamtInsgesamtKeine Berufsausbildung",40451,4183,"10,3",10.340906281674124]
["SWDIIIWeiblichInsgesamtInsgesamtBetriebliche/schulische Ausbildung",62311,6034,"9,7",9.683683458779349]
["SWDIIIWeiblichInsgesamtInsgesamtAkademische Ausbildung",22908,1547,"6,8",6.7530993539374888]
["SWDIIIWeiblichInsgesamtDeutscheInsgesamt",97464,9486,"9,7",9.7328244274809155]
["SWDIIIWeiblichInsgesamtDeutscheKeine Berufsausbildung",25390,2800,"11,0",11.027963765261914]
["SWDIIIWeiblichInsgesamtDeutscheBetriebliche/schulische Ausbildung",55083,5517,"10,0",10.015794346713141]
["SWDIIIWeiblichInsgesamtDeutscheAkademische Ausbildung",16991,1169,"6,9",6.8801130010005291]
["SWDIIIWeiblichInsgesamtAusländerInsgesamt",28206,2278,"8,1",8.0762958235836351]
["SWDIIIWeiblichInsgesamtAusländerKeine Berufsausbildung",15061,1383,"9,2",9.1826571940774198]
["SWDIIIWeiblichInsgesamtAusländerBetriebliche/schulische Ausbildung",7228,517,"7,2",7.1527393469839513]
["SWDIIIWeiblichInsgesamtAusländerAkademische Ausbildung",5917,378,"6,4",6.3883724860571238]
["SWDIIIWeiblich15 bis unter 25 JahreInsgesamtInsgesamt",18385,516,"2,8",2.806635844438401]
["SWDIIIWeiblich15 bis unter 25 JahreInsgesamtKeine Berufsausbildung",8260,299,"3,6",3.6198547215496371]
["SWDIIIWeiblich15 bis unter 25 JahreInsgesamtBetriebliche/schulische Ausbildung",9455,211,"2,2",2.231623479640402]
["SWDIIIWeiblich15 bis unter 25 JahreInsgesamtAkademische Ausbildung",670,6,"0,9",0.89552238805970152]
["SWDIIIWeiblich15 bis unter 25 JahreDeutscheInsgesamt",15607,419,"2,7",2.6846927660665085]
["SWDIIIWeiblich15 bis unter 25 JahreDeutscheKeine Berufsausbildung",6601,231,"3,5",3.4994697773064685]
["SWDIIIWeiblich15 bis unter 25 JahreDeutscheBetriebliche/schulische Ausbildung",8430,186,"2,2",2.2064056939501779]
["SWDIIIWeiblich15 bis unter 25 JahreDeutscheAkademische Ausbildung","*","*","k.A.",{"$error":"#N/A"}]
["SWDIIIWeiblich15 bis unter 25 JahreAusländerInsgesamt",2778,97,"3,5",3.4917206623470123]
["SWDIIIWeiblich15 bis unter 25 JahreAusländerKeine Berufsausbildung",1659,68,"4,1",4.0988547317661244]
["SWDIIIWeiblich15 bis unter 25 JahreAusländerBetriebliche/schulische Ausbildung",1025,25,"2,4",2.4390243902439024]
["SWDIIIWeiblich15 bis unter 25 JahreAusländerAkademische Ausbildung","*","*","4,3",4.2553191489361701]
["SWDIIIWeiblich25 bis unter 35 JahreInsgesamtInsgesamt",33506,1832,"5,5",5.467677430907897]
["SWDIIIWeiblich25 bis unter 35 JahreInsgesamtKeine Berufsausbildung",8649,654,"7,6",7.5615678113076648]
["SWDIIIWeiblich25 bis unter 35 JahreInsgesamtBetriebliche/schulische Ausbildung",15333,851,"5,6",5.5501206547968431]
["SWDIIIWeiblich25 bis unter 35 JahreInsgesamtAkademische Ausbildung",9524,327,"3,4",3.4334313313733724]
["SWDIIIWeiblich25 bis unter 35 JahreDeutscheInsgesamt",24855,1331,"5,4",5.3550593441963388]
["SWDIIIWeiblich25 bis unter 35 JahreDeutscheKeine Berufsausbildung",4755,377,"7,9",7.9284963196635125]
["SWDIIIWeiblich25 bis unter 35 JahreDeutscheBetriebliche/schulische Ausbildung",13183,741,"5,6",5.6208753697944323]
["SWDIIIWeiblich25 bis unter 35 JahreDeutscheAkademische Ausbildung","*","*","3,1",3.0793696689316175]
["SWDIIIWeiblich25 bis unter 35 JahreAusländerInsgesamt",8651,501,"5,8",5.7912380071668021]
["SWDIIIWeiblich25 bis unter 35 JahreAusländerKeine Berufsausbildung",3894,277,"7,1",7.1135079609655882]
["SWDIIIWeiblich25 bis unter 35 JahreAusländerBetriebliche/schulische Ausbildung",2150,110,"5,1",5.1162790697674421]
["SWDIIIWeiblich25 bis unter 35 JahreAusländerAkademische Ausbildung",2607,114,"4,4",4.372842347525892]
["SWDIIIWeiblich35 bis unter 45 JahreInsgesamtInsgesamt",26648,1840,"6,9",6.9048333833683584]
["SWDIIIWeiblich35 bis unter 45 JahreInsgesamtKeine Berufsausbildung",7862,638,"8,1",8.114983464767235]
["SWDIIIWeiblich35 bis unter 45 JahreInsgesamtBetriebliche/schulische Ausbildung",12124,793,"6,5",6.5407456285054444]
["SWDIIIWeiblich35 bis unter 45 JahreInsgesamtAkademische Ausbildung",6662,409,"6,1",6.1392975082557788]
["SWDIIIWeiblich35 bis unter 45 JahreDeutscheInsgesamt",18853,1227,"6,5",6.5082480241871323]
["SWDIIIWeiblich35 bis unter 45 JahreDeutscheKeine Berufsausbildung",3982,317,"8,0",7.9608237066800607]
["SWDIIIWeiblich35 bis unter 45 JahreDeutscheBetriebliche/schulische Ausbildung",10286,653,"6,3",6.3484347657009526]
["SWDIIIWeiblich35 bis unter 45 JahreDeutscheAkademische Ausbildung",4585,257,"5,6",5.605234460196292]
["SWDIIIWeiblich35 bis unter 45 JahreAusländerInsgesamt",7795,613,"7,9",7.8640153944836433]
["SWDIIIWeiblich35 bis unter 45 JahreAusländerKeine Berufsausbildung",3880,321,"8,3",8.2731958762886588]
["SWDIIIWeiblich35 bis unter 45 JahreAusländerBetriebliche/schulische Ausbildung",1838,140,"7,6",7.6169749727965179]
["SWDIIIWeiblich35 bis unter 45 JahreAusländerAkademische Ausbildung",2077,152,"7,3",7.3182474723158402]
["SWDIIIWeiblich45 bis unter 55 JahreInsgesamtInsgesamt",23388,1931,"8,3",8.2563707884385149]
["SWDIIIWeiblich45 bis unter 55 JahreInsgesamtKeine Berufsausbildung",7917,723,"9,1",9.1322470632815449]
["SWDIIIWeiblich45 bis unter 55 JahreInsgesamtBetriebliche/schulische Ausbildung",12122,953,"7,9",7.8617389869658467]
["SWDIIIWeiblich45 bis unter 55 JahreInsgesamtAkademische Ausbildung",3349,255,"7,6",7.6142131979695442]
["SWDIIIWeiblich45 bis unter 55 JahreDeutscheInsgesamt",17360,1407,"8,1",8.1048387096774199]
["SWDIIIWeiblich45 bis unter 55 JahreDeutscheKeine Berufsausbildung",4270,386,"9,0",9.0398126463700237]
["SWDIIIWeiblich45 bis unter 55 JahreDeutscheBetriebliche/schulische Ausbildung",10601,832,"7,8",7.8483161965852286]
["SWDIIIWeiblich45 bis unter 55 JahreDeutscheAkademische Ausbildung",2489,189,"7,6",7.5934110084371227]
["SWDIIIWeiblich45 bis unter 55 JahreAusländerInsgesamt",6028,524,"8,7",8.6927670869276703]
["SWDIIIWeiblich45 bis unter 55 JahreAusländerKeine Berufsausbildung",3647,337,"9,2",9.240471620510009]
["SWDIIIWeiblich45 bis unter 55 JahreAusländerBetriebliche/schulische Ausbildung",1521,121,"8,0",7.9552925706771855]
["SWDIIIWeiblich45 bis unter 55 JahreAusländerAkademische Ausbildung",860,66,"7,7",7.6744186046511631]
["SWDIIIWeiblich55 und älterInsgesamtInsgesamt",23743,5645,"23,8",23.775428547361326]
["SWDIIIWeiblich55 und älterInsgesamtKeine Berufsausbildung",7763,1869,"24,1",24.075743913435527]
["SWDIIIWeiblich55 und älterInsgesamtBetriebliche/schulische Ausbildung",13277,3226,"24,3",24.297657603374255]
["SWDIIIWeiblich55 und älterInsgesamtAkademische Ausbildung",2703,550,"20,3",20.347761746207919]
["SWDIIIWeiblich55 und älterDeutscheInsgesamt",20789,5102,"24,5",24.541825003607677]
["SWDIIIWeiblich55 und älterDeutscheKeine Berufsausbildung",5782,1489,"25,8",25.752334832237977]
["SWDIIIWeiblich55 und älterDeutscheBetriebliche/schulische Ausbildung",12583,3105,"24,7",24.676150361598985]
["SWDIIIWeiblich55 und älterDeutscheAkademische Ausbildung",2424,508,"21,0",20.957095709570957]
["SWDIIIWeiblich55 und älterAusländerInsgesamt",2954,543,"18,4",18.38185511171293]
["SWDIIIWeiblich55 und älterAusländerKeine Berufsausbildung",1981,380,"19,2",19.182231196365471]
["SWDIIIWeiblich55 und älterAusländerBetriebliche/schulische Ausbildung",694,121,"17,4",17.435158501440924]
["SWDIIIWeiblich55 und älterAusländerAkademische Ausbildung",279,42,"15,1",15.053763440860216]
["SWDIIInsgesamtInsgesamtInsgesamtInsgesamt",291595,55795,"19,1",19.134415885046042]
["SWDIIInsgesamtInsgesamtInsgesamtKeine Berufsausbildung",228402,43404,"19,0",19.003336222975282]
["SWDIIInsgesamtInsgesamtInsgesamtBetriebliche/schulische Ausbildung",46661,10226,"21,9",21.915518312937998]
["SWDIIInsgesamtInsgesamtInsgesamtAkademische Ausbildung",16532,2165,"13,1",13.095814178562787]
["SWDIIInsgesamtInsgesamtDeutscheInsgesamt",116138,25128,"21,6",21.636329194578863]
["SWDIIInsgesamtInsgesamtDeutscheKeine Berufsausbildung",76354,16314,"21,4",21.366267648060351]
["SWDIIInsgesamtInsgesamtDeutscheBetriebliche/schulische Ausbildung",35286,8014,"22,7",22.711556991441366]
["SWDIIInsgesamtInsgesamtDeutscheAkademische Ausbildung",4498,800,"17,8",17.785682525566919]
["SWDIIInsgesamtInsgesamtAusländerInsgesamt",175452,30667,"17,5",17.478854615507373]
["SWDIIInsgesamtInsgesamtAusländerKeine Berufsausbildung",152044,27090,"17,8",17.81721080739786]
["SWDIIInsgesamtInsgesamtAusländerBetriebliche/schulische Ausbildung",11374,2212,"19,4",19.44786354844382]
["SWDIIInsgesamtInsgesamtAusländerAkademische Ausbildung",12034,1365,"11,3",11.34286189130796]
["SWDIIInsgesamt15 bis unter 25 JahreInsgesamtInsgesamt",50271,5551,"11,0",11.042151538660461]
["SWDIIInsgesamt15 bis unter 25 JahreInsgesamtKeine Berufsausbildung",47741,5293,"11,1",11.086906432626046]
["SWDIIInsgesamt15 bis unter 25 JahreInsgesamtBetriebliche/schulische Ausbildung",1924,224,"11,6",11.642411642411643]
["SWDIIInsgesamt15 bis unter 25 JahreInsgesamtAkademische Ausbildung",606,34,"5,6",5.6105610561056105]
["SWDIIInsgesamt15 bis unter 25 JahreDeutscheInsgesamt",21629,2812,"13,0",13.001063387119146]
["SWDIIInsgesamt15 bis unter 25 JahreDeutscheKeine Berufsausbildung",20293,2646,"13,0",13.038978958261469]
["SWDIIInsgesamt15 bis unter 25 JahreDeutscheBetriebliche/schulische Ausbildung",1217,159,"13,1",13.064913722267871]
["SWDIIInsgesamt15 bis unter 25 JahreDeutscheAkademische Ausbildung",119,7,"5,9",5.8823529411764701]
["SWDIIInsgesamt15 bis unter 25 JahreAusländerInsgesamt",28640,2739,"9,6",9.563547486033519]
["SWDIIInsgesamt15 bis unter 25 JahreAusländerKeine Berufsausbildung",27447,2647,"9,6",9.6440412431231088]
["SWDIIInsgesamt15 bis unter 25 JahreAusländerBetriebliche/schulische Ausbildung",706,65,"9,2",9.2067988668555234]
["SWDIIInsgesamt15 bis unter 25 JahreAusländerAkademische Ausbildung",487,27,"5,5",5.5441478439425058]
["SWDIIInsgesamt25 bis unter 35 JahreInsgesamtInsgesamt",76711,14786,"19,3",19.274941012371109]
["SWDIIInsgesamt25 bis unter 35 JahreInsgesamtKeine Berufsausbildung",60574,12051,"19,9",19.894674282695547]
["SWDIIInsgesamt25 bis unter 35 JahreInsgesamtBetriebliche/schulische Ausbildung",10741,2209,"20,6",20.566055302113398]
["SWDIIInsgesamt25 bis unter 35 JahreInsgesamtAkademische Ausbildung",5396,526,"9,7",9.7479614529280951]
["SWDIIInsgesamt25 bis unter 35 JahreDeutscheInsgesamt",29813,6844,"23,0",22.956428403716501]
["SWDIIInsgesamt25 bis unter 35 JahreDeutscheKeine Berufsausbildung",19954,4922,"24,7",24.666733487020146]
["SWDIIInsgesamt25 bis unter 35 JahreDeutscheBetriebliche/schulische Ausbildung",8043,1732,"21,5",21.534253388039289]
["SWDIIInsgesamt25 bis unter 35 JahreDeutscheAkademische Ausbildung",1816,190,"10,5",10.462555066079295]
["SWDIIInsgesamt25 bis unter 35 JahreAusländerInsgesamt",46898,7942,"16,9",16.934624077785834]
["SWDIIInsgesamt25 bis unter 35 JahreAusländerKeine Berufsausbildung",40620,7129,"17,6",17.550467749876908]
["SWDIIInsgesamt25 bis unter 35 JahreAusländerBetriebliche/schulische Ausbildung",2698,477,"17,7",17.679762787249814]
["SWDIIInsgesamt25 bis unter 35 JahreAusländerAkademische Ausbildung",3580,336,"9,4",9.3854748603351954]
["SWDIIInsgesamt35 bis unter 45 JahreInsgesamtInsgesamt",75805,15595,"20,6",20.572521601477476]
["SWDIIInsgesamt35 bis unter 45 JahreInsgesamtKeine Berufsausbildung",56986,11903,"20,9",20.8875864247359]
["SWDIIInsgesamt35 bis unter 45 JahreInsgesamtBetriebliche/schulische Ausbildung",12955,2942,"22,7",22.709378618294096]
["SWDIIInsgesamt35 bis unter 45 JahreInsgesamtAkademische Ausbildung",5864,750,"12,8",12.789904502046385]
["SWDIIInsgesamt35 bis unter 45 JahreDeutscheInsgesamt",25543,6345,"24,8",24.840465098069924]
["SWDIIInsgesamt35 bis unter 45 JahreDeutscheKeine Berufsausbildung",14968,3857,"25,8",25.76830571886692]
["SWDIIInsgesamt35 bis unter 45 JahreDeutscheBetriebliche/schulische Ausbildung",9446,2263,"24,0",23.957230573787847]
["SWDIIInsgesamt35 bis unter 45 JahreDeutscheAkademische Ausbildung",1129,225,"19,9",19.929140832595216]
["SWDIIInsgesamt35 bis unter 45 JahreAusländerInsgesamt",50259,9250,"18,4",18.404663841302053]
["SWDIIInsgesamt35 bis unter 45 JahreAusländerKeine Berufsausbildung",42015,8046,"19,2",19.150303463048914]
["SWDIIInsgesamt35 bis unter 45 JahreAusländerBetriebliche/schulische Ausbildung",3509,679,"19,4",19.350242234254775]
["SWDIIInsgesamt35 bis unter 45 JahreAusländerAkademische Ausbildung",4735,525,"11,1",11.087645195353749]
["SWDIIInsgesamt45 bis unter 55 JahreInsgesamtInsgesamt",52652,11492,"21,8",21.826331383423231]
["SWDIIInsgesamt45 bis unter 55 JahreInsgesamtKeine Berufsausbildung",38196,8391,"22,0",21.968268928683631]
["SWDIIInsgesamt45 bis unter 55 JahreInsgesamtBetriebliche/schulische Ausbildung",11492,2646,"23,0",23.024712843717367]
["SWDIIInsgesamt45 bis unter 55 JahreInsgesamtAkademische Ausbildung",2964,455,"15,4",15.350877192982457]
["SWDIIInsgesamt45 bis unter 55 JahreDeutscheInsgesamt",20638,4782,"23,2",23.170849888555093]
["SWDIIInsgesamt45 bis unter 55 JahreDeutscheKeine Berufsausbildung",11227,2598,"23,1",23.140643092544757]
["SWDIIInsgesamt45 bis unter 55 JahreDeutscheBetriebliche/schulische Ausbildung",8652,2009,"23,2",23.220064724919094]
["SWDIIInsgesamt45 bis unter 55 JahreDeutscheAkademische Ausbildung",759,175,"23,1",23.056653491436098]
["SWDIIInsgesamt45 bis unter 55 JahreAusländerInsgesamt",32014,6710,"21,0",20.959580183669644]
["SWDIIInsgesamt45 bis unter 55 JahreAusländerKeine Berufsausbildung",26969,5793,"21,5",21.480218028106343]
["SWDIIInsgesamt45 bis unter 55 JahreAusländerBetriebliche/schulische Ausbildung",2840,637,"22,4",22.429577464788732]
["SWDIIInsgesamt45 bis unter 55 JahreAusländerAkademische Ausbildung",2205,280,"12,7",12.698412698412698]
["SWDIIInsgesamt55 und älterInsgesamtInsgesamt",36156,8371,"23,2",23.152450492311097]
["SWDIIInsgesamt55 und älterInsgesamtKeine Berufsausbildung",24905,5766,"23,2",23.151977514555313]
["SWDIIInsgesamt55 und älterInsgesamtBetriebliche/schulische Ausbildung",9549,2205,"23,1",23.091423185673893]
["SWDIIInsgesamt55 und älterInsgesamtAkademische Ausbildung",1702,400,"23,5",23.501762632197416]
["SWDIIInsgesamt55 und älterDeutscheInsgesamt",18515,4345,"23,5",23.467458817175263]
["SWDIIInsgesamt55 und älterDeutscheKeine Berufsausbildung",9912,2291,"23,1",23.113397901533496]
["SWDIIInsgesamt55 und älterDeutscheBetriebliche/schulische Ausbildung",7928,1851,"23,3",23.347628657921291]
["SWDIIInsgesamt55 und älterDeutscheAkademische Ausbildung",675,203,"30,1",30.074074074074076]
["SWDIIInsgesamt55 und älterAusländerInsgesamt",17641,4026,"22,8",22.821835496853922]
["SWDIIInsgesamt55 und älterAusländerKeine Berufsausbildung",14993,3475,"23,2",23.177482825318481]
["SWDIIInsgesamt55 und älterAusländerBetriebliche/schulische Ausbildung",1621,354,"21,8",21.838371375694017]
["SWDIIInsgesamt55 und älterAusländerAkademische Ausbildung",1027,197,"19,2",19.182083739045762]
["SWDIIMännlichInsgesamtInsgesamtInsgesamt",138416,27216,"19,7",19.662466766847764]
["SWDIIMännlichInsgesamtInsgesamtKeine Berufsausbildung",106871,20469,"19,2",19.152997539089181]
["SWDIIMännlichInsgesamtInsgesamtBetriebliche/schulische Ausbildung",24956,5778,"23,2",23.1527488379548]
["SWDIIMännlichInsgesamtInsgesamtAkademische Ausbildung",6589,969,"14,7",14.706328729701019]
["SWDIIMännlichInsgesamtDeutscheInsgesamt",62260,14058,"22,6",22.579505300353357]
["SWDIIMännlichInsgesamtDeutscheKeine Berufsausbildung",39998,8823,"22,1",22.058602930146506]
["SWDIIMännlichInsgesamtDeutscheBetriebliche/schulische Ausbildung",19938,4780,"24,0",23.974320393218978]
["SWDIIMännlichInsgesamtDeutscheAkademische Ausbildung",2324,455,"19,6",19.578313253012048]
["SWDIIMännlichInsgesamtAusländerInsgesamt",76153,13158,"17,3",17.278373800112931]
["SWDIIMännlichInsgesamtAusländerKeine Berufsausbildung",66871,11646,"17,4",17.415621121263328]
["SWDIIMännlichInsgesamtAusländerBetriebliche/schulische Ausbildung",5017,998,"19,9",19.892365955750449]
["SWDIIMännlichInsgesamtAusländerAkademische Ausbildung",4265,514,"12,1",12.051582649472451]
["SWDIIMännlich15 bis unter 25 JahreInsgesamtInsgesamt",26522,3086,"11,6",11.635623256164694]
["SWDIIMännlich15 bis unter 25 JahreInsgesamtKeine Berufsausbildung",25468,2956,"11,6",11.606722161143395]
["SWDIIMännlich15 bis unter 25 JahreInsgesamtBetriebliche/schulische Ausbildung",902,118,"13,1",13.082039911308204]
["SWDIIMännlich15 bis unter 25 JahreInsgesamtAkademische Ausbildung",152,12,"7,9",7.8947368421052628]
["SWDIIMännlich15 bis unter 25 JahreDeutscheInsgesamt",11533,1580,"13,7",13.699817913812536]
["SWDIIMännlich15 bis unter 25 JahreDeutscheKeine Berufsausbildung",10909,1494,"13,7",13.695114125951049]
["SWDIIMännlich15 bis unter 25 JahreDeutscheBetriebliche/schulische Ausbildung",582,82,"14,1",14.0893470790378]
["SWDIIMännlich15 bis unter 25 JahreDeutscheAkademische Ausbildung","*","*","9,5",9.5238095238095237]
["SWDIIMännlich15 bis unter 25 JahreAusländerInsgesamt",14988,1506,"10,0",10.048038430744596]
["SWDIIMännlich15 bis unter 25 JahreAusländerKeine Berufsausbildung",14559,1462,"10,0",10.041898482038601]
["SWDIIMännlich15 bis unter 25 JahreAusländerBetriebliche/schulische Ausbildung",319,36,"11,3",11.285266457680251]
["SWDIIMännlich15 bis unter 25 JahreAusländerAkademische Ausbildung","*","*","7,3",7.2727272727272725]
["SWDIIMännlich25 bis unter 35 JahreInsgesamtInsgesamt",37541,7348,"19,6",19.573266561892328]
["SWDIIMännlich25 bis unter 35 JahreInsgesamtKeine Berufsausbildung",29709,5949,"20,0",20.024235080278704]
["SWDIIMännlich25 bis unter 35 JahreInsgesamtBetriebliche/schulische Ausbildung",5589,1182,"21,1",21.148684916800857]
["SWDIIMännlich25 bis unter 35 JahreInsgesamtAkademische Ausbildung",2243,217,"9,7",9.6745430227374065]
["SWDIIMännlich25 bis unter 35 JahreDeutscheInsgesamt",16095,3777,"23,5",23.466915191053122]
["SWDIIMännlich25 bis unter 35 JahreDeutscheKeine Berufsausbildung",10886,2710,"24,9",24.894359728091125]
["SWDIIMännlich25 bis unter 35 JahreDeutscheBetriebliche/schulische Ausbildung",4331,966,"22,3",22.304317709535905]
["SWDIIMännlich25 bis unter 35 JahreDeutscheAkademische Ausbildung","*","*","11,5",11.503416856492027]
["SWDIIMännlich25 bis unter 35 JahreAusländerInsgesamt",21446,3571,"16,7",16.651123752681151]
["SWDIIMännlich25 bis unter 35 JahreAusländerKeine Berufsausbildung",18823,3239,"17,2",17.207671465759976]
["SWDIIMännlich25 bis unter 35 JahreAusländerBetriebliche/schulische Ausbildung",1258,216,"17,2",17.170111287758345]
["SWDIIMännlich25 bis unter 35 JahreAusländerAkademische Ausbildung",1365,116,"8,5",8.4981684981684982]
["SWDIIMännlich35 bis unter 45 JahreInsgesamtInsgesamt",33111,7138,"21,6",21.557790462384101]
["SWDIIMännlich35 bis unter 45 JahreInsgesamtKeine Berufsausbildung",24293,5241,"21,6",21.574116000493969]
["SWDIIMännlich35 bis unter 45 JahreInsgesamtBetriebliche/schulische Ausbildung",6644,1579,"23,8",23.765803732691147]
["SWDIIMännlich35 bis unter 45 JahreInsgesamtAkademische Ausbildung",2174,318,"14,6",14.627414903403862]
["SWDIIMännlich35 bis unter 45 JahreDeutscheInsgesamt",13453,3440,"25,6",25.570504720136771]
["SWDIIMännlich35 bis unter 45 JahreDeutscheKeine Berufsausbildung",7742,2044,"26,4",26.40144665461121]
["SWDIIMännlich35 bis unter 45 JahreDeutscheBetriebliche/schulische Ausbildung",5145,1285,"25,0",24.9757045675413]
["SWDIIMännlich35 bis unter 45 JahreDeutscheAkademische Ausbildung",566,111,"19,6",19.6113074204947]
["SWDIIMännlich35 bis unter 45 JahreAusländerInsgesamt",19656,3698,"18,8",18.813593813593812]
["SWDIIMännlich35 bis unter 45 JahreAusländerKeine Berufsausbildung",16549,3197,"19,3",19.318387817995045]
["SWDIIMännlich35 bis unter 45 JahreAusländerBetriebliche/schulische Ausbildung",1499,294,"19,6",19.613075383589059]
["SWDIIMännlich35 bis unter 45 JahreAusländerAkademische Ausbildung",1608,207,"12,9",12.87313432835821]
["SWDIIMännlich45 bis unter 55 JahreInsgesamtInsgesamt",23929,5532,"23,1",23.118391909398639]
["SWDIIMännlich45 bis unter 55 JahreInsgesamtKeine Berufsausbildung",16482,3736,"22,7",22.667152044654777]
["SWDIIMännlich45 bis unter 55 JahreInsgesamtBetriebliche/schulische Ausbildung",6263,1582,"25,3",25.259460322529137]
["SWDIIMännlich45 bis unter 55 JahreInsgesamtAkademische Ausbildung",1184,214,"18,1",18.074324324324326]
["SWDIIMännlich45 bis unter 55 JahreDeutscheInsgesamt",11085,2782,"25,1",25.096977898060441]
["SWDIIMännlich45 bis unter 55 JahreDeutscheKeine Berufsausbildung",5624,1390,"24,7",24.715504978662871]
["SWDIIMännlich45 bis unter 55 JahreDeutscheBetriebliche/schulische Ausbildung",5035,1281,"25,4",25.441906653426017]
["SWDIIMännlich45 bis unter 55 JahreDeutscheAkademische Ausbildung",426,111,"26,1",26.056338028169012]
["SWDIIMännlich45 bis unter 55 JahreAusländerInsgesamt",12844,2750,"21,4",21.410775459358454]
["SWDIIMännlich45 bis unter 55 JahreAusländerKeine Berufsausbildung",10858,2346,"21,6",21.606188985080124]
["SWDIIMännlich45 bis unter 55 JahreAusländerBetriebliche/schulische Ausbildung",1228,301,"24,5",24.511400651465799]
["SWDIIMännlich45 bis unter 55 JahreAusländerAkademische Ausbildung",758,103,"13,6",13.588390501319262]
["SWDIIMännlich55 und älterInsgesamtInsgesamt",17313,4112,"23,8",23.750938601051232]
["SWDIIMännlich55 und älterInsgesamtKeine Berufsausbildung",10919,2587,"23,7",23.692645846689256]
["SWDIIMännlich55 und älterInsgesamtBetriebliche/schulische Ausbildung",5558,1317,"23,7",23.695573947463117]
["SWDIIMännlich55 und älterInsgesamtAkademische Ausbildung",836,208,"24,9",24.880382775119617]
["SWDIIMännlich55 und älterDeutscheInsgesamt",10094,2479,"24,6",24.559144045967901]
["SWDIIMännlich55 und älterDeutscheKeine Berufsausbildung",4837,1185,"24,5",24.498656191854458]
["SWDIIMännlich55 und älterDeutscheBetriebliche/schulische Ausbildung",4845,1166,"24,1",24.066047471620227]
["SWDIIMännlich55 und älterDeutscheAkademische Ausbildung",412,128,"31,1",31.067961165048541]
["SWDIIMännlich55 und älterAusländerInsgesamt",7219,1633,"22,6",22.620861615182157]
["SWDIIMännlich55 und älterAusländerKeine Berufsausbildung",6082,1402,"23,1",23.051627754028281]
["SWDIIMännlich55 und älterAusländerBetriebliche/schulische Ausbildung",713,151,"21,2",21.1781206171108]
["SWDIIMännlich55 und älterAusländerAkademische Ausbildung",424,80,"18,9",18.867924528301888]
["SWDIIWeiblichInsgesamtInsgesamtInsgesamt",153176,28579,"18,7",18.657622604063302]
["SWDIIWeiblichInsgesamtInsgesamtKeine Berufsausbildung",121528,22935,"18,9",18.872194062273714]
["SWDIIWeiblichInsgesamtInsgesamtBetriebliche/schulische Ausbildung",21705,4448,"20,5",20.492973969131537]
["SWDIIWeiblichInsgesamtInsgesamtAkademische Ausbildung",9943,1196,"12,0",12.028562808005631]
["SWDIIWeiblichInsgesamtDeutscheInsgesamt",53876,11070,"20,5",20.547182418887814]
["SWDIIWeiblichInsgesamtDeutscheKeine Berufsausbildung",36354,7491,"20,6",20.60571051328602]
["SWDIIWeiblichInsgesamtDeutscheBetriebliche/schulische Ausbildung",15348,3234,"21,1",21.071149335418298]
["SWDIIWeiblichInsgesamtDeutscheAkademische Ausbildung",2174,345,"15,9",15.869365225390986]
["SWDIIWeiblichInsgesamtAusländerInsgesamt",99298,17509,"17,6",17.632782130556507]
["SWDIIWeiblichInsgesamtAusländerKeine Berufsausbildung",85172,15444,"18,1",18.132719673132016]
["SWDIIWeiblichInsgesamtAusländerBetriebliche/schulische Ausbildung",6357,1214,"19,1",19.097058360862043]
["SWDIIWeiblichInsgesamtAusländerAkademische Ausbildung",7769,851,"11,0",10.953790706654654]
["SWDIIWeiblich15 bis unter 25 JahreInsgesamtInsgesamt",23748,2465,"10,4",10.379821458649149]
["SWDIIWeiblich15 bis unter 25 JahreInsgesamtKeine Berufsausbildung",22272,2337,"10,5",10.492995689655173]
["SWDIIWeiblich15 bis unter 25 JahreInsgesamtBetriebliche/schulische Ausbildung",1022,106,"10,4",10.371819960861057]
["SWDIIWeiblich15 bis unter 25 JahreInsgesamtAkademische Ausbildung",454,22,"4,8",4.8458149779735686]
["SWDIIWeiblich15 bis unter 25 JahreDeutscheInsgesamt",10096,1232,"12,2",12.202852614896988]
["SWDIIWeiblich15 bis unter 25 JahreDeutscheKeine Berufsausbildung",9384,1152,"12,3",12.276214833759591]
["SWDIIWeiblich15 bis unter 25 JahreDeutscheBetriebliche/schulische Ausbildung",635,77,"12,1",12.125984251968504]
["SWDIIWeiblich15 bis unter 25 JahreDeutscheAkademische Ausbildung","*","*","3,9",3.8961038961038961]
["SWDIIWeiblich15 bis unter 25 JahreAusländerInsgesamt",13651,1233,"9,0",9.0323053256171715]
["SWDIIWeiblich15 bis unter 25 JahreAusländerKeine Berufsausbildung",12887,1185,"9,2",9.1953131062310867]
["SWDIIWeiblich15 bis unter 25 JahreAusländerBetriebliche/schulische Ausbildung",387,29,"7,5",7.4935400516795871]
["SWDIIWeiblich15 bis unter 25 JahreAusländerAkademische Ausbildung","*","*","5,0",5.0397877984084882]
["SWDIIWeiblich25 bis unter 35 JahreInsgesamtInsgesamt",39169,7438,"19,0",18.989507008093135]
["SWDIIWeiblich25 bis unter 35 JahreInsgesamtKeine Berufsausbildung",30864,6102,"19,8",19.770606531881803]
["SWDIIWeiblich25 bis unter 35 JahreInsgesamtBetriebliche/schulische Ausbildung",5152,1027,"19,9",19.934006211180126]
["SWDIIWeiblich25 bis unter 35 JahreInsgesamtAkademische Ausbildung",3153,309,"9,8",9.8001902949571846]
["SWDIIWeiblich25 bis unter 35 JahreDeutscheInsgesamt",13717,3067,"22,4",22.359116424874241]
["SWDIIWeiblich25 bis unter 35 JahreDeutscheKeine Berufsausbildung",9067,2212,"24,4",24.396161905812285]
["SWDIIWeiblich25 bis unter 35 JahreDeutscheBetriebliche/schulische Ausbildung",3712,766,"20,6",20.635775862068968]
["SWDIIWeiblich25 bis unter 35 JahreDeutscheAkademische Ausbildung","*","*","9,5",9.4882729211087415]
["SWDIIWeiblich25 bis unter 35 JahreAusländerInsgesamt",25452,4371,"17,2",17.173503064592175]
["SWDIIWeiblich25 bis unter 35 JahreAusländerKeine Berufsausbildung",21797,3890,"17,8",17.846492636601365]
["SWDIIWeiblich25 bis unter 35 JahreAusländerBetriebliche/schulische Ausbildung",1440,261,"18,1",18.125]
["SWDIIWeiblich25 bis unter 35 JahreAusländerAkademische Ausbildung",2215,220,"9,9",9.932279909706546]
["SWDIIWeiblich35 bis unter 45 JahreInsgesamtInsgesamt",42694,8457,"19,8",19.808403991193142]
["SWDIIWeiblich35 bis unter 45 JahreInsgesamtKeine Berufsausbildung",32693,6662,"20,4",20.377450830453004]
["SWDIIWeiblich35 bis unter 45 JahreInsgesamtBetriebliche/schulische Ausbildung",6311,1363,"21,6",21.597211218507368]
["SWDIIWeiblich35 bis unter 45 JahreInsgesamtAkademische Ausbildung",3690,432,"11,7",11.707317073170733]
["SWDIIWeiblich35 bis unter 45 JahreDeutscheInsgesamt",12090,2905,"24,0",24.028122415219187]
["SWDIIWeiblich35 bis unter 45 JahreDeutscheKeine Berufsausbildung",7226,1813,"25,1",25.089952947688904]
["SWDIIWeiblich35 bis unter 45 JahreDeutscheBetriebliche/schulische Ausbildung",4301,978,"22,7",22.738897930713787]
["SWDIIWeiblich35 bis unter 45 JahreDeutscheAkademische Ausbildung",563,114,"20,2",20.24866785079929]
["SWDIIWeiblich35 bis unter 45 JahreAusländerInsgesamt",30603,5552,"18,1",18.142012221024082]
["SWDIIWeiblich35 bis unter 45 JahreAusländerKeine Berufsausbildung",25466,4849,"19,0",19.041074373674704]
["SWDIIWeiblich35 bis unter 45 JahreAusländerBetriebliche/schulische Ausbildung",2010,385,"19,2",19.154228855721392]
["SWDIIWeiblich35 bis unter 45 JahreAusländerAkademische Ausbildung",3127,318,"10,2",10.16949152542373]
["SWDIIWeiblich45 bis unter 55 JahreInsgesamtInsgesamt",28722,5960,"20,8",20.75064410556368]
["SWDIIWeiblich45 bis unter 55 JahreInsgesamtKeine Berufsausbildung",21713,4655,"21,4",21.438769400819783]
["SWDIIWeiblich45 bis unter 55 JahreInsgesamtBetriebliche/schulische Ausbildung",5229,1064,"20,3",20.348058902275771]
["SWDIIWeiblich45 bis unter 55 JahreInsgesamtAkademische Ausbildung",1780,241,"13,5",13.539325842696629]
["SWDIIWeiblich45 bis unter 55 JahreDeutscheInsgesamt",9552,2000,"20,9",20.938023450586265]
["SWDIIWeiblich45 bis unter 55 JahreDeutscheKeine Berufsausbildung",5602,1208,"21,6",21.563727240271334]
["SWDIIWeiblich45 bis unter 55 JahreDeutscheBetriebliche/schulische Ausbildung",3617,728,"20,1",20.127177218689521]
["SWDIIWeiblich45 bis unter 55 JahreDeutscheAkademische Ausbildung",333,64,"19,2",19.219219219219219]
["SWDIIWeiblich45 bis unter 55 JahreAusländerInsgesamt",19170,3960,"20,7",20.657276995305164]
["SWDIIWeiblich45 bis unter 55 JahreAusländerKeine Berufsausbildung",16111,3447,"21,4",21.395319967723918]
["SWDIIWeiblich45 bis unter 55 JahreAusländerBetriebliche/schulische Ausbildung",1612,336,"20,8",20.843672456575682]
["SWDIIWeiblich45 bis unter 55 JahreAusländerAkademische Ausbildung",1447,177,"12,2",12.232204561161023]
["SWDIIWeiblich55 und älterInsgesamtInsgesamt",18843,4259,"22,6",22.602557979090378]
["SWDIIWeiblich55 und älterInsgesamtKeine Berufsausbildung",13986,3179,"22,7",22.729872729872731]
["SWDIIWeiblich55 und älterInsgesamtBetriebliche/schulische Ausbildung",3991,888,"22,3",22.250062640942119]
["SWDIIWeiblich55 und älterInsgesamtAkademische Ausbildung",866,192,"22,2",22.170900692840647]
["SWDIIWeiblich55 und älterDeutscheInsgesamt",8421,1866,"22,2",22.15888849305308]
["SWDIIWeiblich55 und älterDeutscheKeine Berufsausbildung",5075,1106,"21,8",21.793103448275865]
["SWDIIWeiblich55 und älterDeutscheBetriebliche/schulische Ausbildung",3083,685,"22,2",22.21861822899773]
["SWDIIWeiblich55 und älterDeutscheAkademische Ausbildung",263,75,"28,5",28.517110266159694]
["SWDIIWeiblich55 und älterAusländerInsgesamt",10422,2393,"23,0",22.961043945499902]
["SWDIIWeiblich55 und älterAusländerKeine Berufsausbildung",8911,2073,"23,3",23.263382336438109]
["SWDIIWeiblich55 und älterAusländerBetriebliche/schulische Ausbildung",908,203,"22,4",22.356828193832598]
["SWDIIWeiblich55 und älterAusländerAkademische Ausbildung",603,117,"19,4",19.402985074626866]
["NRWInsgesamtInsgesamtInsgesamtInsgesamtInsgesamt",1054289,182005,"17,3",17.263293081877929]
["NRWInsgesamtInsgesamtInsgesamtInsgesamtKeine Berufsausbildung",627018,119425,"19,0",19.046502652236459]
["NRWInsgesamtInsgesamtInsgesamtInsgesamtBetriebliche/schulische Ausbildung",323929,50847,"15,7",15.696958284068421]
["NRWInsgesamtInsgesamtInsgesamtInsgesamtAkademische Ausbildung",103342,11733,"11,4",11.353563894641095]
["NRWInsgesamtInsgesamtInsgesamtDeutscheInsgesamt",630056,105003,"16,7",16.665661465012636]
["NRWInsgesamtInsgesamtInsgesamtDeutscheKeine Berufsausbildung",284766,54560,"19,2",19.159590681471805]
["NRWInsgesamtInsgesamtInsgesamtDeutscheBetriebliche/schulische Ausbildung",276841,43393,"15,7",15.674340144703999]
["NRWInsgesamtInsgesamtInsgesamtDeutscheAkademische Ausbildung",68449,7050,"10,3",10.29963914739441]
["NRWInsgesamtInsgesamtInsgesamtAusländerInsgesamt",424227,77001,"18,2",18.15089562899108]
["NRWInsgesamtInsgesamtInsgesamtAusländerKeine Berufsausbildung",342246,64864,"19,0",18.952449407735955]
["NRWInsgesamtInsgesamtInsgesamtAusländerBetriebliche/schulische Ausbildung",47088,7454,"15,8",15.829935440027182]
["NRWInsgesamtInsgesamtInsgesamtAusländerAkademische Ausbildung",34893,4683,"13,4",13.4210300060184]
["NRWInsgesamtInsgesamt15 bis unter 25 JahreInsgesamtInsgesamt",172649,15620,"9,0",9.0472577310033646]
["NRWInsgesamtInsgesamt15 bis unter 25 JahreInsgesamtKeine Berufsausbildung",131357,13941,"10,6",10.6130621131725]
["NRWInsgesamtInsgesamt15 bis unter 25 JahreInsgesamtBetriebliche/schulische Ausbildung",38627,1542,"4,0",3.9920263028451601]
["NRWInsgesamtInsgesamt15 bis unter 25 JahreInsgesamtAkademische Ausbildung",2665,137,"5,1",5.1407129455909946]
["NRWInsgesamtInsgesamt15 bis unter 25 JahreDeutscheInsgesamt",109299,9131,"8,4",8.3541477964116773]
["NRWInsgesamtInsgesamt15 bis unter 25 JahreDeutscheKeine Berufsausbildung",73966,7838,"10,6",10.596760673823107]
["NRWInsgesamtInsgesamt15 bis unter 25 JahreDeutscheBetriebliche/schulische Ausbildung",33740,1260,"3,7",3.7344398340248963]
["NRWInsgesamtInsgesamt15 bis unter 25 JahreDeutscheAkademische Ausbildung",1593,33,"2,1",2.0715630885122414]
["NRWInsgesamtInsgesamt15 bis unter 25 JahreAusländerInsgesamt",63350,6489,"10,2",10.243093922651934]
["NRWInsgesamtInsgesamt15 bis unter 25 JahreAusländerKeine Berufsausbildung",57391,6103,"10,6",10.634071544318797]
["NRWInsgesamtInsgesamt15 bis unter 25 JahreAusländerBetriebliche/schulische Ausbildung",4887,282,"5,8",5.7704112952731732]
["NRWInsgesamtInsgesamt15 bis unter 25 JahreAusländerAkademische Ausbildung",1072,104,"9,7",9.7014925373134329]
["NRWInsgesamtInsgesamt25 bis unter 35 JahreInsgesamtInsgesamt",288231,43946,"15,2",15.246798574754278]
["NRWInsgesamtInsgesamt25 bis unter 35 JahreInsgesamtKeine Berufsausbildung",166460,32308,"19,4",19.408866995073893]
["NRWInsgesamtInsgesamt25 bis unter 35 JahreInsgesamtBetriebliche/schulische Ausbildung",82709,9139,"11,0",11.049583479427874]
["NRWInsgesamtInsgesamt25 bis unter 35 JahreInsgesamtAkademische Ausbildung",39062,2499,"6,4",6.3975218882801697]
["NRWInsgesamtInsgesamt25 bis unter 35 JahreDeutscheInsgesamt",166123,23277,"14,0",14.011906840112449]
["NRWInsgesamtInsgesamt25 bis unter 35 JahreDeutscheKeine Berufsausbildung",70819,14788,"20,9",20.881401883675284]
["NRWInsgesamtInsgesamt25 bis unter 35 JahreDeutscheBetriebliche/schulische Ausbildung",68777,7311,"10,6",10.630007124474753]
["NRWInsgesamtInsgesamt25 bis unter 35 JahreDeutscheAkademische Ausbildung",26527,1178,"4,4",4.4407584724997173]
["NRWInsgesamtInsgesamt25 bis unter 35 JahreAusländerInsgesamt",122108,20669,"16,9",16.926818881645755]
["NRWInsgesamtInsgesamt25 bis unter 35 JahreAusländerKeine Berufsausbildung",95641,17520,"18,3",18.318503570644388]
["NRWInsgesamtInsgesamt25 bis unter 35 JahreAusländerBetriebliche/schulische Ausbildung",13932,1828,"13,1",13.120872810795293]
["NRWInsgesamtInsgesamt25 bis unter 35 JahreAusländerAkademische Ausbildung",12535,1321,"10,5",10.538492221779018]
["NRWInsgesamtInsgesamt35 bis unter 45 JahreInsgesamtInsgesamt",243067,43714,"18,0",17.984341765850566]
["NRWInsgesamtInsgesamt35 bis unter 45 JahreInsgesamtKeine Berufsausbildung",143642,30193,"21,0",21.019618217512985]
["NRWInsgesamtInsgesamt35 bis unter 45 JahreInsgesamtBetriebliche/schulische Ausbildung",68646,10245,"14,9",14.924394720741194]
["NRWInsgesamtInsgesamt35 bis unter 45 JahreInsgesamtAkademische Ausbildung",30779,3276,"10,6",10.643620650443484]
["NRWInsgesamtInsgesamt35 bis unter 45 JahreDeutscheInsgesamt",125020,20867,"16,7",16.690929451287793]
["NRWInsgesamtInsgesamt35 bis unter 45 JahreDeutscheKeine Berufsausbildung",51713,11328,"21,9",21.905516987991412]
["NRWInsgesamtInsgesamt35 bis unter 45 JahreDeutscheBetriebliche/schulische Ausbildung",55686,8073,"14,5",14.4973601982545]
["NRWInsgesamtInsgesamt35 bis unter 45 JahreDeutscheAkademische Ausbildung",17621,1466,"8,3",8.3196186368537539]
["NRWInsgesamtInsgesamt35 bis unter 45 JahreAusländerInsgesamt",118045,22847,"19,4",19.354483459697573]
["NRWInsgesamtInsgesamt35 bis unter 45 JahreAusländerKeine Berufsausbildung",91927,18865,"20,5",20.521718319971281]
["NRWInsgesamtInsgesamt35 bis unter 45 JahreAusländerBetriebliche/schulische Ausbildung",12960,2172,"16,8",16.75925925925926]
["NRWInsgesamtInsgesamt35 bis unter 45 JahreAusländerAkademische Ausbildung",13158,1810,"13,8",13.755889952880377]
["NRWInsgesamtInsgesamt45 bis unter 55 JahreInsgesamtInsgesamt",190798,35192,"18,4",18.444637784463151]
["NRWInsgesamtInsgesamt45 bis unter 55 JahreInsgesamtKeine Berufsausbildung",109180,23094,"21,2",21.152225682359408]
["NRWInsgesamtInsgesamt45 bis unter 55 JahreInsgesamtBetriebliche/schulische Ausbildung",65295,10050,"15,4",15.391683896163567]
["NRWInsgesamtInsgesamt45 bis unter 55 JahreInsgesamtAkademische Ausbildung",16323,2048,"12,5",12.546713226735282]
["NRWInsgesamtInsgesamt45 bis unter 55 JahreDeutscheInsgesamt",110564,18612,"16,8",16.833689085054811]
["NRWInsgesamtInsgesamt45 bis unter 55 JahreDeutscheKeine Berufsausbildung",45139,9274,"20,5",20.545426349719754]
["NRWInsgesamtInsgesamt45 bis unter 55 JahreDeutscheBetriebliche/schulische Ausbildung",54860,8177,"14,9",14.90521327014218]
["NRWInsgesamtInsgesamt45 bis unter 55 JahreDeutscheAkademische Ausbildung",10565,1161,"11,0",10.989115002366304]
["NRWInsgesamtInsgesamt45 bis unter 55 JahreAusländerInsgesamt",80230,16579,"20,7",20.6643400224355]
["NRWInsgesamtInsgesamt45 bis unter 55 JahreAusländerKeine Berufsausbildung",64037,13819,"21,6",21.579711729156582]
["NRWInsgesamtInsgesamt45 bis unter 55 JahreAusländerBetriebliche/schulische Ausbildung",10435,1873,"17,9",17.949209391471012]
["NRWInsgesamtInsgesamt45 bis unter 55 JahreAusländerAkademische Ausbildung",5758,887,"15,4",15.404654393886766]
["NRWInsgesamtInsgesamt55 und älterInsgesamtInsgesamt",159544,43533,"27,3",27.28588978588979]
["NRWInsgesamtInsgesamt55 und älterInsgesamtKeine Berufsausbildung",76379,19889,"26,0",26.039880071747469]
["NRWInsgesamtInsgesamt55 und älterInsgesamtBetriebliche/schulische Ausbildung",68652,19871,"28,9",28.944531841752607]
["NRWInsgesamtInsgesamt55 und älterInsgesamtAkademische Ausbildung",14513,3773,"26,0",25.997381657824022]
["NRWInsgesamtInsgesamt55 und älterDeutscheInsgesamt",119050,33116,"27,8",27.816883662326752]
["NRWInsgesamtInsgesamt55 und älterDeutscheKeine Berufsausbildung",43129,11332,"26,3",26.274664378956153]
["NRWInsgesamtInsgesamt55 und älterDeutscheBetriebliche/schulische Ausbildung",63778,18572,"29,1",29.119759164602215]
["NRWInsgesamtInsgesamt55 und älterDeutscheAkademische Ausbildung",12143,3212,"26,5",26.451453512311616]
["NRWInsgesamtInsgesamt55 und älterAusländerInsgesamt",40494,10417,"25,7",25.724798735615153]
["NRWInsgesamtInsgesamt55 und älterAusländerKeine Berufsausbildung",33250,8557,"25,7",25.735338345864662]
["NRWInsgesamtInsgesamt55 und älterAusländerBetriebliche/schulische Ausbildung",4874,1299,"26,7",26.651620845301601]
["NRWInsgesamtInsgesamt55 und älterAusländerAkademische Ausbildung",2370,561,"23,7",23.670886075949369]
["NRWInsgesamtMännlichInsgesamtInsgesamtInsgesamt",563067,96823,"17,2",17.195644568053183]
["NRWInsgesamtMännlichInsgesamtInsgesamtKeine Berufsausbildung",335006,61685,"18,4",18.413103048900616]
["NRWInsgesamtMännlichInsgesamtInsgesamtBetriebliche/schulische Ausbildung",180843,29056,"16,1",16.066975221601059]
["NRWInsgesamtMännlichInsgesamtInsgesamtAkademische Ausbildung",47218,6082,"12,9",12.880681096192131]
["NRWInsgesamtMännlichInsgesamtDeutscheInsgesamt",346256,59403,"17,2",17.155803798345733]
["NRWInsgesamtMännlichInsgesamtDeutscheKeine Berufsausbildung",159394,30036,"18,8",18.843871162026176]
["NRWInsgesamtMännlichInsgesamtDeutscheBetriebliche/schulische Ausbildung",154405,25184,"16,3",16.310352644020597]
["NRWInsgesamtMännlichInsgesamtDeutscheAkademische Ausbildung",32457,4183,"12,9",12.887820809070464]
["NRWInsgesamtMännlichInsgesamtAusländerInsgesamt",216809,37420,"17,3",17.259431112177079]
["NRWInsgesamtMännlichInsgesamtAusländerKeine Berufsausbildung",175610,31649,"18,0",18.022322191219178]
["NRWInsgesamtMännlichInsgesamtAusländerBetriebliche/schulische Ausbildung",26438,3872,"14,6",14.645585899084651]
["NRWInsgesamtMännlichInsgesamtAusländerAkademische Ausbildung",14761,1899,"12,9",12.86498204728677]
["NRWInsgesamtMännlich15 bis unter 25 JahreInsgesamtInsgesamt",99556,9029,"9,1",9.069267547912732]
["NRWInsgesamtMännlich15 bis unter 25 JahreInsgesamtKeine Berufsausbildung",76456,8113,"10,6",10.611332007952285]
["NRWInsgesamtMännlich15 bis unter 25 JahreInsgesamtBetriebliche/schulische Ausbildung",22199,867,"3,9",3.9055813324924546]
["NRWInsgesamtMännlich15 bis unter 25 JahreInsgesamtAkademische Ausbildung",901,49,"5,4",5.4384017758046621]
["NRWInsgesamtMännlich15 bis unter 25 JahreDeutscheInsgesamt",63479,5229,"8,2",8.2373698388443426]
["NRWInsgesamtMännlich15 bis unter 25 JahreDeutscheKeine Berufsausbildung",43339,4489,"10,4",10.357876277717528]
["NRWInsgesamtMännlich15 bis unter 25 JahreDeutscheBetriebliche/schulische Ausbildung",19530,724,"3,7",3.7071172555043526]
["NRWInsgesamtMännlich15 bis unter 25 JahreDeutscheAkademische Ausbildung",610,16,"2,6",2.622950819672131]
["NRWInsgesamtMännlich15 bis unter 25 JahreAusländerInsgesamt",36077,3800,"10,5",10.533026582032875]
["NRWInsgesamtMännlich15 bis unter 25 JahreAusländerKeine Berufsausbildung",33117,3624,"10,9",10.943020201105172]
["NRWInsgesamtMännlich15 bis unter 25 JahreAusländerBetriebliche/schulische Ausbildung",2669,143,"5,4",5.3578119145747474]
["NRWInsgesamtMännlich15 bis unter 25 JahreAusländerAkademische Ausbildung",291,33,"11,3",11.340206185567011]
["NRWInsgesamtMännlich25 bis unter 35 JahreInsgesamtInsgesamt",159698,23585,"14,8",14.768500544778268]
["NRWInsgesamtMännlich25 bis unter 35 JahreInsgesamtKeine Berufsausbildung",95347,17339,"18,2",18.185155274943103]
["NRWInsgesamtMännlich25 bis unter 35 JahreInsgesamtBetriebliche/schulische Ausbildung",47735,5132,"10,8",10.751021263224048]
["NRWInsgesamtMännlich25 bis unter 35 JahreInsgesamtAkademische Ausbildung",16616,1114,"6,7",6.7043813192103991]
["NRWInsgesamtMännlich25 bis unter 35 JahreDeutscheInsgesamt",92530,13092,"14,1",14.148924673079003]
["NRWInsgesamtMännlich25 bis unter 35 JahreDeutscheKeine Berufsausbildung",41831,8306,"19,9",19.856087590542899]
["NRWInsgesamtMännlich25 bis unter 35 JahreDeutscheBetriebliche/schulische Ausbildung",39619,4198,"10,6",10.59592619702668]
["NRWInsgesamtMännlich25 bis unter 35 JahreDeutscheAkademische Ausbildung",11080,588,"5,3",5.3068592057761732]
["NRWInsgesamtMännlich25 bis unter 35 JahreAusländerInsgesamt",67168,10493,"15,6",15.622022391615054]
["NRWInsgesamtMännlich25 bis unter 35 JahreAusländerKeine Berufsausbildung",53516,9033,"16,9",16.879064205097542]
["NRWInsgesamtMännlich25 bis unter 35 JahreAusländerBetriebliche/schulische Ausbildung",8116,934,"11,5",11.508132084770823]
["NRWInsgesamtMännlich25 bis unter 35 JahreAusländerAkademische Ausbildung",5536,526,"9,5",9.5014450867052034]
["NRWInsgesamtMännlich35 bis unter 45 JahreInsgesamtInsgesamt",123002,21694,"17,6",17.637111591681435]
["NRWInsgesamtMännlich35 bis unter 45 JahreInsgesamtKeine Berufsausbildung",71451,14546,"20,4",20.358007585618115]
["NRWInsgesamtMännlich35 bis unter 45 JahreInsgesamtBetriebliche/schulische Ausbildung",37977,5726,"15,1",15.077546936303552]
["NRWInsgesamtMännlich35 bis unter 45 JahreInsgesamtAkademische Ausbildung",13574,1422,"10,5",10.475909827611611]
["NRWInsgesamtMännlich35 bis unter 45 JahreDeutscheInsgesamt",67573,11481,"17,0",16.990513962677401]
["NRWInsgesamtMännlich35 bis unter 45 JahreDeutscheKeine Berufsausbildung",28508,6107,"21,4",21.422056966465554]
["NRWInsgesamtMännlich35 bis unter 45 JahreDeutscheBetriebliche/schulische Ausbildung",30889,4641,"15,0",15.024766097963676]
["NRWInsgesamtMännlich35 bis unter 45 JahreDeutscheAkademische Ausbildung",8176,733,"9,0",8.9652641878669286]
["NRWInsgesamtMännlich35 bis unter 45 JahreAusländerInsgesamt",55428,10213,"18,4",18.425705419643499]
["NRWInsgesamtMännlich35 bis unter 45 JahreAusländerKeine Berufsausbildung",42942,8439,"19,7",19.652088864049183]
["NRWInsgesamtMännlich35 bis unter 45 JahreAusländerBetriebliche/schulische Ausbildung",7088,1085,"15,3",15.307562076749438]
["NRWInsgesamtMännlich35 bis unter 45 JahreAusländerAkademische Ausbildung",5398,689,"12,8",12.763986661726564]
["NRWInsgesamtMännlich45 bis unter 55 JahreInsgesamtInsgesamt",96117,18206,"18,9",18.941498382180054]
["NRWInsgesamtMännlich45 bis unter 55 JahreInsgesamtKeine Berufsausbildung",53202,11375,"21,4",21.380775158828616]
["NRWInsgesamtMännlich45 bis unter 55 JahreInsgesamtBetriebliche/schulische Ausbildung",35280,5788,"16,4",16.405895691609977]
["NRWInsgesamtMännlich45 bis unter 55 JahreInsgesamtAkademische Ausbildung",7635,1043,"13,7",13.660772757039949]
["NRWInsgesamtMännlich45 bis unter 55 JahreDeutscheInsgesamt",58007,10488,"18,1",18.080576482148704]
["NRWInsgesamtMännlich45 bis unter 55 JahreDeutscheKeine Berufsausbildung",23221,5021,"21,6",21.622669135696139]
["NRWInsgesamtMännlich45 bis unter 55 JahreDeutscheBetriebliche/schulische Ausbildung",29566,4801,"16,2",16.238246634647908]
["NRWInsgesamtMännlich45 bis unter 55 JahreDeutscheAkademische Ausbildung",5220,666,"12,8",12.758620689655173]
["NRWInsgesamtMännlich45 bis unter 55 JahreAusländerInsgesamt",38109,7718,"20,3",20.252433808286757]
["NRWInsgesamtMännlich45 bis unter 55 JahreAusländerKeine Berufsausbildung",29980,6354,"21,2",21.194129419613077]
["NRWInsgesamtMännlich45 bis unter 55 JahreAusländerBetriebliche/schulische Ausbildung",5714,987,"17,3",17.273363668183407]
["NRWInsgesamtMännlich45 bis unter 55 JahreAusländerAkademische Ausbildung",2415,377,"15,6",15.610766045548655]
["NRWInsgesamtMännlich55 und älterInsgesamtInsgesamt",84694,24309,"28,7",28.702151273998155]
["NRWInsgesamtMännlich55 und älterInsgesamtKeine Berufsausbildung",38550,10312,"26,7",26.749675745784696]
["NRWInsgesamtMännlich55 und älterInsgesamtBetriebliche/schulische Ausbildung",37652,11543,"30,7",30.657070009561245]
["NRWInsgesamtMännlich55 und älterInsgesamtAkademische Ausbildung",8492,2454,"28,9",28.897786151672161]
["NRWInsgesamtMännlich55 und älterDeutscheInsgesamt",64667,19113,"29,6",29.55603321632363]
["NRWInsgesamtMännlich55 und älterDeutscheKeine Berufsausbildung",22495,6113,"27,2",27.174927761724827]
["NRWInsgesamtMännlich55 und älterDeutscheBetriebliche/schulische Ausbildung",34801,10820,"31,1",31.09106060170685]
["NRWInsgesamtMännlich55 und älterDeutscheAkademische Ausbildung",7371,2180,"29,6",29.575362908696238]
["NRWInsgesamtMännlich55 und älterAusländerInsgesamt",20027,5196,"25,9",25.944974284715634]
["NRWInsgesamtMännlich55 und älterAusländerKeine Berufsausbildung",16055,4199,"26,2",26.153846153846157]
["NRWInsgesamtMännlich55 und älterAusländerBetriebliche/schulische Ausbildung",2851,723,"25,4",25.359522974394949]
["NRWInsgesamtMännlich55 und älterAusländerAkademische Ausbildung",1121,274,"24,4",24.442462087421944]
["NRWInsgesamtWeiblichInsgesamtInsgesamtInsgesamt",491214,85182,"17,3",17.341118127740661]
["NRWInsgesamtWeiblichInsgesamtInsgesamtKeine Berufsausbildung",292008,57740,"19,8",19.773430864907809]
["NRWInsgesamtWeiblichInsgesamtInsgesamtBetriebliche/schulische Ausbildung",143086,21791,"15,2",15.229302657143256]
["NRWInsgesamtWeiblichInsgesamtInsgesamtAkademische Ausbildung",56120,5651,"10,1",10.069493941553812]
["NRWInsgesamtWeiblichInsgesamtDeutscheInsgesamt",283797,45600,"16,1",16.067823127094368]
["NRWInsgesamtWeiblichInsgesamtDeutscheKeine Berufsausbildung",125372,24524,"19,6",19.560986504163608]
["NRWInsgesamtWeiblichInsgesamtDeutscheBetriebliche/schulische Ausbildung",122436,18209,"14,9",14.872259792871379]
["NRWInsgesamtWeiblichInsgesamtDeutscheAkademische Ausbildung",35989,2867,"8,0",7.966323043152074]
["NRWInsgesamtWeiblichInsgesamtAusländerInsgesamt",207413,39581,"19,1",19.083181864203304]
["NRWInsgesamtWeiblichInsgesamtAusländerKeine Berufsausbildung",166632,33215,"19,9",19.933146094387631]
["NRWInsgesamtWeiblichInsgesamtAusländerBetriebliche/schulische Ausbildung",20650,3582,"17,3",17.346246973365616]
["NRWInsgesamtWeiblichInsgesamtAusländerAkademische Ausbildung",20131,2784,"13,8",13.829417316576425]
["NRWInsgesamtWeiblich15 bis unter 25 JahreInsgesamtInsgesamt",73092,6591,"9,0",9.0174027253324578]
["NRWInsgesamtWeiblich15 bis unter 25 JahreInsgesamtKeine Berufsausbildung",54900,5828,"10,6",10.615664845173042]
["NRWInsgesamtWeiblich15 bis unter 25 JahreInsgesamtBetriebliche/schulische Ausbildung",16428,675,"4,1",4.1088385682980277]
["NRWInsgesamtWeiblich15 bis unter 25 JahreInsgesamtAkademische Ausbildung",1764,88,"5,0",4.9886621315192743]
["NRWInsgesamtWeiblich15 bis unter 25 JahreDeutscheInsgesamt",45820,3902,"8,5",8.5159319074639885]
["NRWInsgesamtWeiblich15 bis unter 25 JahreDeutscheKeine Berufsausbildung",30627,3349,"10,9",10.934796094948901]
["NRWInsgesamtWeiblich15 bis unter 25 JahreDeutscheBetriebliche/schulische Ausbildung",14210,536,"3,8",3.7719915552427867]
["NRWInsgesamtWeiblich15 bis unter 25 JahreDeutscheAkademische Ausbildung",983,17,"1,7",1.7293997965412005]
["NRWInsgesamtWeiblich15 bis unter 25 JahreAusländerInsgesamt",27272,2689,"9,9",9.8599295981226156]
["NRWInsgesamtWeiblich15 bis unter 25 JahreAusländerKeine Berufsausbildung",24273,2479,"10,2",10.212993861492194]
["NRWInsgesamtWeiblich15 bis unter 25 JahreAusländerBetriebliche/schulische Ausbildung",2218,139,"6,3",6.2669071235347165]
["NRWInsgesamtWeiblich15 bis unter 25 JahreAusländerAkademische Ausbildung",781,71,"9,1",9.0909090909090917]
["NRWInsgesamtWeiblich25 bis unter 35 JahreInsgesamtInsgesamt",128528,20361,"15,8",15.841684302253206]
["NRWInsgesamtWeiblich25 bis unter 35 JahreInsgesamtKeine Berufsausbildung",71111,14969,"21,1",21.050189140920534]
["NRWInsgesamtWeiblich25 bis unter 35 JahreInsgesamtBetriebliche/schulische Ausbildung",34974,4007,"11,5",11.457082404071596]
["NRWInsgesamtWeiblich25 bis unter 35 JahreInsgesamtAkademische Ausbildung",22443,1385,"6,2",6.1711892349507647]
["NRWInsgesamtWeiblich25 bis unter 35 JahreDeutscheInsgesamt",73591,10185,"13,8",13.840007609626175]
["NRWInsgesamtWeiblich25 bis unter 35 JahreDeutscheKeine Berufsausbildung",28988,6482,"22,4",22.360976955981783]
["NRWInsgesamtWeiblich25 bis unter 35 JahreDeutscheBetriebliche/schulische Ausbildung",29158,3113,"10,7",10.676315247959394]
["NRWInsgesamtWeiblich25 bis unter 35 JahreDeutscheAkademische Ausbildung",15445,590,"3,8",3.8200064745872453]
["NRWInsgesamtWeiblich25 bis unter 35 JahreAusländerInsgesamt",54937,10176,"18,5",18.523035477000928]
["NRWInsgesamtWeiblich25 bis unter 35 JahreAusländerKeine Berufsausbildung",42123,8487,"20,1",20.148137597037248]
["NRWInsgesamtWeiblich25 bis unter 35 JahreAusländerBetriebliche/schulische Ausbildung",5816,894,"15,4",15.371389270976616]
["NRWInsgesamtWeiblich25 bis unter 35 JahreAusländerAkademische Ausbildung",6998,795,"11,4",11.360388682480709]
["NRWInsgesamtWeiblich35 bis unter 45 JahreInsgesamtInsgesamt",120064,22020,"18,3",18.340218550106609]
["NRWInsgesamtWeiblich35 bis unter 45 JahreInsgesamtKeine Berufsausbildung",72190,15647,"21,7",21.674747194902341]
["NRWInsgesamtWeiblich35 bis unter 45 JahreInsgesamtBetriebliche/schulische Ausbildung",30669,4519,"14,7",14.734748443053247]
["NRWInsgesamtWeiblich35 bis unter 45 JahreInsgesamtAkademische Ausbildung",17205,1854,"10,8",10.775937227550131]
["NRWInsgesamtWeiblich35 bis unter 45 JahreDeutscheInsgesamt",57447,9386,"16,3",16.338538130798824]
["NRWInsgesamtWeiblich35 bis unter 45 JahreDeutscheKeine Berufsausbildung",23205,5221,"22,5",22.499461322990737]
["NRWInsgesamtWeiblich35 bis unter 45 JahreDeutscheBetriebliche/schulische Ausbildung",24797,3432,"13,8",13.840383917409364]
["NRWInsgesamtWeiblich35 bis unter 45 JahreDeutscheAkademische Ausbildung",9445,733,"7,8",7.7607199576495507]
["NRWInsgesamtWeiblich35 bis unter 45 JahreAusländerInsgesamt",62616,12634,"20,2",20.176951577871471]
["NRWInsgesamtWeiblich35 bis unter 45 JahreAusländerKeine Berufsausbildung",48984,10426,"21,3",21.284501061571127]
["NRWInsgesamtWeiblich35 bis unter 45 JahreAusländerBetriebliche/schulische Ausbildung",5872,1087,"18,5",18.51158038147139]
["NRWInsgesamtWeiblich35 bis unter 45 JahreAusländerAkademische Ausbildung",7760,1121,"14,4",14.445876288659793]
["NRWInsgesamtWeiblich45 bis unter 55 JahreInsgesamtInsgesamt",94681,16986,"17,9",17.940241442316832]
["NRWInsgesamtWeiblich45 bis unter 55 JahreInsgesamtKeine Berufsausbildung",55978,11719,"20,9",20.935010182571727]
["NRWInsgesamtWeiblich45 bis unter 55 JahreInsgesamtBetriebliche/schulische Ausbildung",30015,4262,"14,2",14.199566883225053]
["NRWInsgesamtWeiblich45 bis unter 55 JahreInsgesamtAkademische Ausbildung",8688,1005,"11,6",11.567679558011051]
["NRWInsgesamtWeiblich45 bis unter 55 JahreDeutscheInsgesamt",52557,8124,"15,5",15.457503282150808]
["NRWInsgesamtWeiblich45 bis unter 55 JahreDeutscheKeine Berufsausbildung",21918,4253,"19,4",19.404142713751256]
["NRWInsgesamtWeiblich45 bis unter 55 JahreDeutscheBetriebliche/schulische Ausbildung",25294,3376,"13,3",13.347038823436389]
["NRWInsgesamtWeiblich45 bis unter 55 JahreDeutscheAkademische Ausbildung",5345,495,"9,3",9.2609915809167447]
["NRWInsgesamtWeiblich45 bis unter 55 JahreAusländerInsgesamt",42121,8861,"21,0",21.037012416609294]
["NRWInsgesamtWeiblich45 bis unter 55 JahreAusländerKeine Berufsausbildung",34057,7465,"21,9",21.919135566843821]
["NRWInsgesamtWeiblich45 bis unter 55 JahreAusländerBetriebliche/schulische Ausbildung",4721,886,"18,8",18.767210336793053]
["NRWInsgesamtWeiblich45 bis unter 55 JahreAusländerAkademische Ausbildung",3343,510,"15,3",15.25575830092731]
["NRWInsgesamtWeiblich55 und älterInsgesamtInsgesamt",74849,19224,"25,7",25.68370986920333]
["NRWInsgesamtWeiblich55 und älterInsgesamtKeine Berufsausbildung",37829,9577,"25,3",25.31655608131328]
["NRWInsgesamtWeiblich55 und älterInsgesamtBetriebliche/schulische Ausbildung",31000,8328,"26,9",26.864516129032257]
["NRWInsgesamtWeiblich55 und älterInsgesamtAkademische Ausbildung",6020,1319,"21,9",21.910299003322258]
["NRWInsgesamtWeiblich55 und älterDeutscheInsgesamt",54382,14003,"25,7",25.749328822036706]
["NRWInsgesamtWeiblich55 und älterDeutscheKeine Berufsausbildung",20634,5219,"25,3",25.293205389163514]
["NRWInsgesamtWeiblich55 und älterDeutscheBetriebliche/schulische Ausbildung",28977,7752,"26,8",26.752251785899162]
["NRWInsgesamtWeiblich55 und älterDeutscheAkademische Ausbildung",4771,1032,"21,6",21.630685390903377]
["NRWInsgesamtWeiblich55 und älterAusländerInsgesamt",20467,5221,"25,5",25.509356525138028]
["NRWInsgesamtWeiblich55 und älterAusländerKeine Berufsausbildung",17195,4358,"25,3",25.34457691189299]
["NRWInsgesamtWeiblich55 und älterAusländerBetriebliche/schulische Ausbildung",2023,576,"28,5",28.472565496786949]
["NRWInsgesamtWeiblich55 und älterAusländerAkademische Ausbildung",1249,287,"23,0",22.978382706164933]
["NRWIIIInsgesamtInsgesamtInsgesamtInsgesamt",492069,58903,"12,0",11.970475685320555]
["NRWIIIInsgesamtInsgesamtInsgesamtKeine Berufsausbildung",184229,23468,"12,7",12.738493939607769]
["NRWIIIInsgesamtInsgesamtInsgesamtBetriebliche/schulische Ausbildung",232122,28769,"12,4",12.393913545463162]
["NRWIIIInsgesamtInsgesamtInsgesamtAkademische Ausbildung",75718,6666,"8,8",8.803719062838427]
["NRWIIIInsgesamtInsgesamtDeutscheInsgesamt",373494,45637,"12,2",12.218937921358844]
["NRWIIIInsgesamtInsgesamtDeutscheKeine Berufsausbildung",108454,14156,"13,1",13.052538403378392]
["NRWIIIInsgesamtInsgesamtDeutscheBetriebliche/schulische Ausbildung",204940,26056,"12,7",12.713965062945251]
["NRWIIIInsgesamtInsgesamtDeutscheAkademische Ausbildung",60100,5425,"9,0",9.0266222961730449]
["NRWIIIInsgesamtInsgesamtAusländerInsgesamt",118575,13266,"11,2",11.187855787476281]
["NRWIIIInsgesamtInsgesamtAusländerKeine Berufsausbildung",75775,9312,"12,3",12.289013526888816]
["NRWIIIInsgesamtInsgesamtAusländerBetriebliche/schulische Ausbildung",27182,2713,"10,0",9.9808696931793097]
["NRWIIIInsgesamtInsgesamtAusländerAkademische Ausbildung",15618,1241,"7,9",7.9459597899859142]
["NRWIIIInsgesamt15 bis unter 25 JahreInsgesamtInsgesamt",77425,3086,"4,0",3.9857927026154343]
["NRWIIIInsgesamt15 bis unter 25 JahreInsgesamtKeine Berufsausbildung",40681,1960,"4,8",4.8179739927730392]
["NRWIIIInsgesamt15 bis unter 25 JahreInsgesamtBetriebliche/schulische Ausbildung",35194,1113,"3,2",3.1624708757174518]
["NRWIIIInsgesamt15 bis unter 25 JahreInsgesamtAkademische Ausbildung",1550,13,"0,8",0.83870967741935476]
["NRWIIIInsgesamt15 bis unter 25 JahreDeutscheInsgesamt",62679,2294,"3,7",3.6599179948627132]
["NRWIIIInsgesamt15 bis unter 25 JahreDeutscheKeine Berufsausbildung",29907,1337,"4,5",4.4705252950814192]
["NRWIIIInsgesamt15 bis unter 25 JahreDeutscheBetriebliche/schulische Ausbildung",31424,948,"3,0",3.0168024439918533]
["NRWIIIInsgesamt15 bis unter 25 JahreDeutscheAkademische Ausbildung",1348,9,"0,7",0.66765578635014833]
["NRWIIIInsgesamt15 bis unter 25 JahreAusländerInsgesamt",14746,792,"5,4",5.3709480537094807]
["NRWIIIInsgesamt15 bis unter 25 JahreAusländerKeine Berufsausbildung",10774,623,"5,8",5.7824392054947094]
["NRWIIIInsgesamt15 bis unter 25 JahreAusländerBetriebliche/schulische Ausbildung",3770,165,"4,4",4.3766578249336874]
["NRWIIIInsgesamt15 bis unter 25 JahreAusländerAkademische Ausbildung",202,4,"2,0",1.9801980198019802]
["NRWIIIInsgesamt25 bis unter 35 JahreInsgesamtInsgesamt",142508,10969,"7,7",7.6971117410952363]
["NRWIIIInsgesamt25 bis unter 35 JahreInsgesamtKeine Berufsausbildung",49965,5331,"10,7",10.669468628039628]
["NRWIIIInsgesamt25 bis unter 35 JahreInsgesamtBetriebliche/schulische Ausbildung",62549,4424,"7,1",7.07285488177269]
["NRWIIIInsgesamt25 bis unter 35 JahreInsgesamtAkademische Ausbildung",29994,1214,"4,0",4.0474761618990467]
["NRWIIIInsgesamt25 bis unter 35 JahreDeutscheInsgesamt",102024,7103,"7,0",6.962087351995609]
["NRWIIIInsgesamt25 bis unter 35 JahreDeutscheKeine Berufsausbildung",25349,2695,"10,6",10.631583099925045]
["NRWIIIInsgesamt25 bis unter 35 JahreDeutscheBetriebliche/schulische Ausbildung",53366,3632,"6,8",6.8058314282501957]
["NRWIIIInsgesamt25 bis unter 35 JahreDeutscheAkademische Ausbildung",23309,776,"3,3",3.3291861512720407]
["NRWIIIInsgesamt25 bis unter 35 JahreAusländerInsgesamt",40484,3866,"9,5",9.5494516352139112]
["NRWIIIInsgesamt25 bis unter 35 JahreAusländerKeine Berufsausbildung",24616,2636,"10,7",10.708482287942802]
["NRWIIIInsgesamt25 bis unter 35 JahreAusländerBetriebliche/schulische Ausbildung",9183,792,"8,6",8.6246324730480239]
["NRWIIIInsgesamt25 bis unter 35 JahreAusländerAkademische Ausbildung",6685,438,"6,6",6.5519820493642484]
["NRWIIIInsgesamt35 bis unter 45 JahreInsgesamtInsgesamt",101688,9879,"9,7",9.7150106207222091]
["NRWIIIInsgesamt35 bis unter 45 JahreInsgesamtKeine Berufsausbildung",36547,4510,"12,3",12.340274167510328]
["NRWIIIInsgesamt35 bis unter 45 JahreInsgesamtBetriebliche/schulische Ausbildung",44069,3903,"8,9",8.8565658399328324]
["NRWIIIInsgesamt35 bis unter 45 JahreInsgesamtAkademische Ausbildung",21072,1466,"7,0",6.9570994684889902]
["NRWIIIInsgesamt35 bis unter 45 JahreDeutscheInsgesamt",70773,6408,"9,1",9.0543003687847055]
["NRWIIIInsgesamt35 bis unter 45 JahreDeutscheKeine Berufsausbildung",18021,2166,"12,0",12.019310804061927]
["NRWIIIInsgesamt35 bis unter 45 JahreDeutscheBetriebliche/schulische Ausbildung",37360,3227,"8,6",8.6375802997858671]
["NRWIIIInsgesamt35 bis unter 45 JahreDeutscheAkademische Ausbildung",15392,1015,"6,6",6.5943347193347197]
["NRWIIIInsgesamt35 bis unter 45 JahreAusländerInsgesamt",30915,3471,"11,2",11.227559437166425]
["NRWIIIInsgesamt35 bis unter 45 JahreAusländerKeine Berufsausbildung",18526,2344,"12,7",12.652488394688547]
["NRWIIIInsgesamt35 bis unter 45 JahreAusländerBetriebliche/schulische Ausbildung",6709,676,"10,1",10.076017290207185]
["NRWIIIInsgesamt35 bis unter 45 JahreAusländerAkademische Ausbildung",5680,451,"7,9",7.9401408450704229]
["NRWIIIInsgesamt45 bis unter 55 JahreInsgesamtInsgesamt",83279,9473,"11,4",11.37501651076502]
["NRWIIIInsgesamt45 bis unter 55 JahreInsgesamtKeine Berufsausbildung",30549,4145,"13,6",13.568365576614619]
["NRWIIIInsgesamt45 bis unter 55 JahreInsgesamtBetriebliche/schulische Ausbildung",41302,4322,"10,5",10.464384291317613]
["NRWIIIInsgesamt45 bis unter 55 JahreInsgesamtAkademische Ausbildung",11428,1006,"8,8",8.8029401470073498]
["NRWIIIInsgesamt45 bis unter 55 JahreDeutscheInsgesamt",61609,6797,"11,0",11.032479020922267]
["NRWIIIInsgesamt45 bis unter 55 JahreDeutscheKeine Berufsausbildung",16197,2207,"13,6",13.625980119775265]
["NRWIIIInsgesamt45 bis unter 55 JahreDeutscheBetriebliche/schulische Ausbildung",36212,3786,"10,5",10.455097757649398]
["NRWIIIInsgesamt45 bis unter 55 JahreDeutscheAkademische Ausbildung",9200,804,"8,7",8.7391304347826093]
["NRWIIIInsgesamt45 bis unter 55 JahreAusländerInsgesamt",21670,2676,"12,3",12.348869404706967]
["NRWIIIInsgesamt45 bis unter 55 JahreAusländerKeine Berufsausbildung",14352,1938,"13,5",13.50334448160535]
["NRWIIIInsgesamt45 bis unter 55 JahreAusländerBetriebliche/schulische Ausbildung",5090,536,"10,5",10.530451866404714]
["NRWIIIInsgesamt45 bis unter 55 JahreAusländerAkademische Ausbildung",2228,202,"9,1",9.0664272890484749]
["NRWIIIInsgesamt55 und älterInsgesamtInsgesamt",87169,25496,"29,2",29.248930238961098]
["NRWIIIInsgesamt55 und älterInsgesamtKeine Berufsausbildung",26487,7522,"28,4",28.398837165401897]
["NRWIIIInsgesamt55 und älterInsgesamtBetriebliche/schulische Ausbildung",49008,15007,"30,6",30.621531178583091]
["NRWIIIInsgesamt55 und älterInsgesamtAkademische Ausbildung",11674,2967,"25,4",25.415453143738219]
["NRWIIIInsgesamt55 und älterDeutscheInsgesamt",76409,23035,"30,1",30.14697221531495]
["NRWIIIInsgesamt55 und älterDeutscheKeine Berufsausbildung",18980,5751,"30,3",30.300316122233927]
["NRWIIIInsgesamt55 und älterDeutscheBetriebliche/schulische Ausbildung",46578,14463,"31,1",31.051140023186914]
["NRWIIIInsgesamt55 und älterDeutscheAkademische Ausbildung",10851,2821,"26,0",25.997603907473966]
["NRWIIIInsgesamt55 und älterAusländerInsgesamt",10760,2461,"22,9",22.871747211895908]
["NRWIIIInsgesamt55 und älterAusländerKeine Berufsausbildung",7507,1771,"23,6",23.591314772878647]
["NRWIIIInsgesamt55 und älterAusländerBetriebliche/schulische Ausbildung",2430,544,"22,4",22.386831275720166]
["NRWIIIInsgesamt55 und älterAusländerAkademische Ausbildung",823,146,"17,7",17.739975698663425]
["NRWIIIMännlichInsgesamtInsgesamtInsgesamt",286653,35593,"12,4",12.416754752261445]
["NRWIIIMännlichInsgesamtInsgesamtKeine Berufsausbildung",120690,15196,"12,6",12.590935454470131]
["NRWIIIMännlichInsgesamtInsgesamtBetriebliche/schulische Ausbildung",130591,16623,"12,7",12.729054835325559]
["NRWIIIMännlichInsgesamtInsgesamtAkademische Ausbildung",35372,3774,"10,7",10.669456066945607]
["NRWIIIMännlichInsgesamtDeutscheInsgesamt",209154,26887,"12,9",12.85512110693556]
["NRWIIIMännlichInsgesamtDeutscheKeine Berufsausbildung",67045,8682,"12,9",12.949511522112015]
["NRWIIIMännlichInsgesamtDeutscheBetriebliche/schulische Ausbildung",113930,14969,"13,1",13.138769419819187]
["NRWIIIMännlichInsgesamtDeutscheAkademische Ausbildung",28179,3236,"11,5",11.483729018063096]
["NRWIIIMännlichInsgesamtAusländerInsgesamt",77499,8706,"11,2",11.233693337978554]
["NRWIIIMännlichInsgesamtAusländerKeine Berufsausbildung",53645,6514,"12,1",12.142790567620468]
["NRWIIIMännlichInsgesamtAusländerBetriebliche/schulische Ausbildung",16661,1654,"9,9",9.927375307604585]
["NRWIIIMännlichInsgesamtAusländerAkademische Ausbildung",7193,538,"7,5",7.4794939524537751]
["NRWIIIMännlich15 bis unter 25 JahreInsgesamtInsgesamt",48371,2016,"4,2",4.1677864836368901]
["NRWIIIMännlich15 bis unter 25 JahreInsgesamtKeine Berufsausbildung",27182,1343,"4,9",4.9407696269590167]
["NRWIIIMännlich15 bis unter 25 JahreInsgesamtBetriebliche/schulische Ausbildung",20611,665,"3,2",3.226432487506671]
["NRWIIIMännlich15 bis unter 25 JahreInsgesamtAkademische Ausbildung",578,8,"1,4",1.3840830449826991]
["NRWIIIMännlich15 bis unter 25 JahreDeutscheInsgesamt",38213,1468,"3,8",3.8416245780231861]
["NRWIIIMännlich15 bis unter 25 JahreDeutscheKeine Berufsausbildung",19262,886,"4,6",4.5997300384176096]
["NRWIIIMännlich15 bis unter 25 JahreDeutscheBetriebliche/schulische Ausbildung",18436,576,"3,1",3.1243219787372531]
["NRWIIIMännlich15 bis unter 25 JahreDeutscheAkademische Ausbildung","*","*","1,2",1.1650485436893203]
["NRWIIIMännlich15 bis unter 25 JahreAusländerInsgesamt",10158,548,"5,4",5.3947627485725533]
["NRWIIIMännlich15 bis unter 25 JahreAusländerKeine Berufsausbildung",7920,457,"5,8",5.7702020202020199]
["NRWIIIMännlich15 bis unter 25 JahreAusländerBetriebliche/schulische Ausbildung",2175,89,"4,1",4.0919540229885056]
["NRWIIIMännlich15 bis unter 25 JahreAusländerAkademische Ausbildung","*","*","k.A.",{"$error":"#N/A"}]
["NRWIIIMännlich25 bis unter 35 JahreInsgesamtInsgesamt",85709,7086,"8,3",8.2675098297728358]
["NRWIIIMännlich25 bis unter 35 JahreInsgesamtKeine Berufsausbildung",36153,3937,"10,9",10.889829336431278]
["NRWIIIMännlich25 bis unter 35 JahreInsgesamtBetriebliche/schulische Ausbildung",36942,2604,"7,0",7.0488874451843433]
["NRWIIIMännlich25 bis unter 35 JahreInsgesamtAkademische Ausbildung",12614,545,"4,3",4.3205961629934997]
["NRWIIIMännlich25 bis unter 35 JahreDeutscheInsgesamt",57990,4435,"7,6",7.6478703224693909]
["NRWIIIMännlich25 bis unter 35 JahreDeutscheKeine Berufsausbildung",17258,1912,"11,1",11.078919921195968]
["NRWIIIMännlich25 bis unter 35 JahreDeutscheBetriebliche/schulische Ausbildung",31198,2148,"6,9",6.885056734406052]
["NRWIIIMännlich25 bis unter 35 JahreDeutscheAkademische Ausbildung","*","*","3,9",3.9332913782252987]
["NRWIIIMännlich25 bis unter 35 JahreAusländerInsgesamt",27719,2651,"9,6",9.5638370792597147]
["NRWIIIMännlich25 bis unter 35 JahreAusländerKeine Berufsausbildung",18895,2025,"10,7",10.71712093146335]
["NRWIIIMännlich25 bis unter 35 JahreAusländerBetriebliche/schulische Ausbildung",5744,456,"7,9",7.9387186629526454]
["NRWIIIMännlich25 bis unter 35 JahreAusländerAkademische Ausbildung",3080,170,"5,5",5.5194805194805197]
["NRWIIIMännlich35 bis unter 45 JahreInsgesamtInsgesamt",58729,5972,"10,2",10.168741167055458]
["NRWIIIMännlich35 bis unter 45 JahreInsgesamtKeine Berufsausbildung",24098,3030,"12,6",12.573657564943149]
["NRWIIIMännlich35 bis unter 45 JahreInsgesamtBetriebliche/schulische Ausbildung",24948,2291,"9,2",9.1831008497675164]
["NRWIIIMännlich35 bis unter 45 JahreInsgesamtAkademische Ausbildung",9683,651,"6,7",6.7231229990705357]
["NRWIIIMännlich35 bis unter 45 JahreDeutscheInsgesamt",39076,3740,"9,6",9.5710922305251298]
["NRWIIIMännlich35 bis unter 45 JahreDeutscheKeine Berufsausbildung",11213,1394,"12,4",12.431998573084812]
["NRWIIIMännlich35 bis unter 45 JahreDeutscheBetriebliche/schulische Ausbildung",20801,1880,"9,0",9.0380270179318316]
["NRWIIIMännlich35 bis unter 45 JahreDeutscheAkademische Ausbildung",7062,466,"6,6",6.59869725290286]
["NRWIIIMännlich35 bis unter 45 JahreAusländerInsgesamt",19653,2232,"11,4",11.357044725996031]
["NRWIIIMännlich35 bis unter 45 JahreAusländerKeine Berufsausbildung",12885,1636,"12,7",12.696934419868064]
["NRWIIIMännlich35 bis unter 45 JahreAusländerBetriebliche/schulische Ausbildung",4147,411,"9,9",9.9107788762961189]
["NRWIIIMännlich35 bis unter 45 JahreAusländerAkademische Ausbildung",2621,185,"7,1",7.0583746661579543]
["NRWIIIMännlich45 bis unter 55 JahreInsgesamtInsgesamt",44942,5418,"12,1",12.055538249299097]
["NRWIIIMännlich45 bis unter 55 JahreInsgesamtKeine Berufsausbildung",17813,2459,"13,8",13.804524785269184]
["NRWIIIMännlich45 bis unter 55 JahreInsgesamtBetriebliche/schulische Ausbildung",21678,2412,"11,1",11.126487683365625]
["NRWIIIMännlich45 bis unter 55 JahreInsgesamtAkademische Ausbildung",5451,547,"10,0",10.034855989726656]
["NRWIIIMännlich45 bis unter 55 JahreDeutscheInsgesamt",31952,3797,"11,9",11.883450175262894]
["NRWIIIMännlich45 bis unter 55 JahreDeutscheKeine Berufsausbildung",8826,1270,"14,4",14.38930432812146]
["NRWIIIMännlich45 bis unter 55 JahreDeutscheBetriebliche/schulische Ausbildung",18678,2076,"11,1",11.114680372630904]
["NRWIIIMännlich45 bis unter 55 JahreDeutscheAkademische Ausbildung",4448,451,"10,1",10.139388489208633]
["NRWIIIMännlich45 bis unter 55 JahreAusländerInsgesamt",12990,1621,"12,5",12.478829869130099]
["NRWIIIMännlich45 bis unter 55 JahreAusländerKeine Berufsausbildung",8987,1189,"13,2",13.230221430955824]
["NRWIIIMännlich45 bis unter 55 JahreAusländerBetriebliche/schulische Ausbildung",3000,336,"11,2",11.200000000000001]
["NRWIIIMännlich45 bis unter 55 JahreAusländerAkademische Ausbildung",1003,96,"9,6",9.5712861415752748]
["NRWIIIMännlich55 und älterInsgesamtInsgesamt",48902,15101,"30,9",30.880127602143059]
["NRWIIIMännlich55 und älterInsgesamtKeine Berufsausbildung",15444,4427,"28,7",28.664853664853663]
["NRWIIIMännlich55 und älterInsgesamtBetriebliche/schulische Ausbildung",26412,8651,"32,8",32.754051188853552]
["NRWIIIMännlich55 und älterInsgesamtAkademische Ausbildung",7046,2023,"28,7",28.711325574794209]
["NRWIIIMännlich55 und älterDeutscheInsgesamt",41923,13447,"32,1",32.075471698113205]
["NRWIIIMännlich55 und älterDeutscheKeine Berufsausbildung",10486,3220,"30,7",30.707610146862486]
["NRWIIIMännlich55 und älterDeutscheBetriebliche/schulische Ausbildung",24817,8289,"33,4",33.400491598501027]
["NRWIIIMännlich55 und älterDeutscheAkademische Ausbildung",6620,1938,"29,3",29.274924471299098]
["NRWIIIMännlich55 und älterAusländerInsgesamt",6979,1654,"23,7",23.699670439891101]
["NRWIIIMännlich55 und älterAusländerKeine Berufsausbildung",4958,1207,"24,3",24.344493747478822]
["NRWIIIMännlich55 und älterAusländerBetriebliche/schulische Ausbildung",1595,362,"22,7",22.695924764890282]
["NRWIIIMännlich55 und älterAusländerAkademische Ausbildung",426,85,"20,0",19.953051643192488]
["NRWIIIWeiblichInsgesamtInsgesamtInsgesamt",205412,23310,"11,3",11.347925145561117]
["NRWIIIWeiblichInsgesamtInsgesamtKeine Berufsausbildung",63539,8272,"13,0",13.018775869938148]
["NRWIIIWeiblichInsgesamtInsgesamtBetriebliche/schulische Ausbildung",101531,12146,"12,0",11.962848785100118]
["NRWIIIWeiblichInsgesamtInsgesamtAkademische Ausbildung",40342,2892,"7,2",7.1687075504437061]
["NRWIIIWeiblichInsgesamtDeutscheInsgesamt",164337,18750,"11,4",11.409481735701638]
["NRWIIIWeiblichInsgesamtDeutscheKeine Berufsausbildung",41409,5474,"13,2",13.21934845081987]
["NRWIIIWeiblichInsgesamtDeutscheBetriebliche/schulische Ausbildung",91010,11087,"12,2",12.182177782661247]
["NRWIIIWeiblichInsgesamtDeutscheAkademische Ausbildung",31918,2189,"6,9",6.8581991352841651]
["NRWIIIWeiblichInsgesamtAusländerInsgesamt",41075,4560,"11,1",11.101643335362143]
["NRWIIIWeiblichInsgesamtAusländerKeine Berufsausbildung",22130,2798,"12,6",12.643470402169003]
["NRWIIIWeiblichInsgesamtAusländerBetriebliche/schulische Ausbildung",10521,1059,"10,1",10.065583119475335]
["NRWIIIWeiblichInsgesamtAusländerAkademische Ausbildung",8424,703,"8,3",8.3452041785375108]
["NRWIIIWeiblich15 bis unter 25 JahreInsgesamtInsgesamt",29054,1070,"3,7",3.6827975493907892]
["NRWIIIWeiblich15 bis unter 25 JahreInsgesamtKeine Berufsausbildung",13499,617,"4,6",4.5707089414030673]
["NRWIIIWeiblich15 bis unter 25 JahreInsgesamtBetriebliche/schulische Ausbildung",14583,448,"3,1",3.0720702187478568]
["NRWIIIWeiblich15 bis unter 25 JahreInsgesamtAkademische Ausbildung",972,5,"0,5",0.51440329218106995]
["NRWIIIWeiblich15 bis unter 25 JahreDeutscheInsgesamt",24466,826,"3,4",3.3761137905665004]
["NRWIIIWeiblich15 bis unter 25 JahreDeutscheKeine Berufsausbildung",10645,451,"4,2",4.2367308595584783]
["NRWIIIWeiblich15 bis unter 25 JahreDeutscheBetriebliche/schulische Ausbildung",12988,372,"2,9",2.8641823221435172]
["NRWIIIWeiblich15 bis unter 25 JahreDeutscheAkademische Ausbildung","*","*","0,4",0.36014405762304924]
["NRWIIIWeiblich15 bis unter 25 JahreAusländerInsgesamt",4588,244,"5,3",5.3182214472537055]
["NRWIIIWeiblich15 bis unter 25 JahreAusländerKeine Berufsausbildung",2854,166,"5,8",5.8163980378416262]
["NRWIIIWeiblich15 bis unter 25 JahreAusländerBetriebliche/schulische Ausbildung",1595,76,"4,8",4.7648902821316614]
["NRWIIIWeiblich15 bis unter 25 JahreAusländerAkademische Ausbildung","*","*","k.A.",{"$error":"#N/A"}]
["NRWIIIWeiblich25 bis unter 35 JahreInsgesamtInsgesamt",56796,3883,"6,8",6.8367490668356927]
["NRWIIIWeiblich25 bis unter 35 JahreInsgesamtKeine Berufsausbildung",13812,1394,"10,1",10.092673037938026]
["NRWIIIWeiblich25 bis unter 35 JahreInsgesamtBetriebliche/schulische Ausbildung",25607,1820,"7,1",7.1074315616823522]
["NRWIIIWeiblich25 bis unter 35 JahreInsgesamtAkademische Ausbildung",17377,669,"3,8",3.8499165563676123]
["NRWIIIWeiblich25 bis unter 35 JahreDeutscheInsgesamt",44032,2668,"6,1",6.0592296511627906]
["NRWIIIWeiblich25 bis unter 35 JahreDeutscheKeine Berufsausbildung",8091,783,"9,7",9.67741935483871]
["NRWIIIWeiblich25 bis unter 35 JahreDeutscheBetriebliche/schulische Ausbildung",22168,1484,"6,7",6.6943341753879464]
["NRWIIIWeiblich25 bis unter 35 JahreDeutscheAkademische Ausbildung","*","*","2,9",2.9114935017788426]
["NRWIIIWeiblich25 bis unter 35 JahreAusländerInsgesamt",12764,1215,"9,5",9.5189595738013164]
["NRWIIIWeiblich25 bis unter 35 JahreAusländerKeine Berufsausbildung",5721,611,"10,7",10.679951057507429]
["NRWIIIWeiblich25 bis unter 35 JahreAusländerBetriebliche/schulische Ausbildung",3439,336,"9,8",9.7702820587380064]
["NRWIIIWeiblich25 bis unter 35 JahreAusländerAkademische Ausbildung",3604,268,"7,4",7.4361820199778021]
["NRWIIIWeiblich35 bis unter 45 JahreInsgesamtInsgesamt",42959,3907,"9,1",9.0947182196978513]
["NRWIIIWeiblich35 bis unter 45 JahreInsgesamtKeine Berufsausbildung",12449,1480,"11,9",11.88850510081131]
["NRWIIIWeiblich35 bis unter 45 JahreInsgesamtBetriebliche/schulische Ausbildung",19121,1612,"8,4",8.4305214162439199]
["NRWIIIWeiblich35 bis unter 45 JahreInsgesamtAkademische Ausbildung",11389,815,"7,2",7.1560277460707695]
["NRWIIIWeiblich35 bis unter 45 JahreDeutscheInsgesamt",31697,2668,"8,4",8.4172003659652326]
["NRWIIIWeiblich35 bis unter 45 JahreDeutscheKeine Berufsausbildung",6808,772,"11,3",11.339600470035252]
["NRWIIIWeiblich35 bis unter 45 JahreDeutscheBetriebliche/schulische Ausbildung",16559,1347,"8,1",8.1345491877528833]
["NRWIIIWeiblich35 bis unter 45 JahreDeutscheAkademische Ausbildung",8330,549,"6,6",6.5906362545018009]
["NRWIIIWeiblich35 bis unter 45 JahreAusländerInsgesamt",11262,1239,"11,0",11.001598295151837]
["NRWIIIWeiblich35 bis unter 45 JahreAusländerKeine Berufsausbildung",5641,708,"12,6",12.550966140755184]
["NRWIIIWeiblich35 bis unter 45 JahreAusländerBetriebliche/schulische Ausbildung",2562,265,"10,3",10.343481654957065]
["NRWIIIWeiblich35 bis unter 45 JahreAusländerAkademische Ausbildung",3059,266,"8,7",8.695652173913043]
["NRWIIIWeiblich45 bis unter 55 JahreInsgesamtInsgesamt",38337,4055,"10,6",10.577249132691655]
["NRWIIIWeiblich45 bis unter 55 JahreInsgesamtKeine Berufsausbildung",12736,1686,"13,2",13.238065326633167]
["NRWIIIWeiblich45 bis unter 55 JahreInsgesamtBetriebliche/schulische Ausbildung",19624,1910,"9,7",9.7329800244598452]
["NRWIIIWeiblich45 bis unter 55 JahreInsgesamtAkademische Ausbildung",5977,459,"7,7",7.679437845072778]
["NRWIIIWeiblich45 bis unter 55 JahreDeutscheInsgesamt",29657,3000,"10,1",10.115655663081229]
["NRWIIIWeiblich45 bis unter 55 JahreDeutscheKeine Berufsausbildung",7371,937,"12,7",12.711979378646046]
["NRWIIIWeiblich45 bis unter 55 JahreDeutscheBetriebliche/schulische Ausbildung",17534,1710,"9,8",9.7524808942625754]
["NRWIIIWeiblich45 bis unter 55 JahreDeutscheAkademische Ausbildung",4752,353,"7,4",7.4284511784511782]
["NRWIIIWeiblich45 bis unter 55 JahreAusländerInsgesamt",8680,1055,"12,2",12.154377880184333]
["NRWIIIWeiblich45 bis unter 55 JahreAusländerKeine Berufsausbildung",5365,749,"14,0",13.96085740913327]
["NRWIIIWeiblich45 bis unter 55 JahreAusländerBetriebliche/schulische Ausbildung",2090,200,"9,6",9.5693779904306222]
["NRWIIIWeiblich45 bis unter 55 JahreAusländerAkademische Ausbildung",1225,106,"8,7",8.6530612244897949]
["NRWIIIWeiblich55 und älterInsgesamtInsgesamt",38266,10395,"27,2",27.165107406052368]
["NRWIIIWeiblich55 und älterInsgesamtKeine Berufsausbildung",11043,3095,"28,0",28.026804310422893]
["NRWIIIWeiblich55 und älterInsgesamtBetriebliche/schulische Ausbildung",22596,6356,"28,1",28.128872366790581]
["NRWIIIWeiblich55 und älterInsgesamtAkademische Ausbildung",4627,944,"20,4",20.401988329371083]
["NRWIIIWeiblich55 und älterDeutscheInsgesamt",34485,9588,"27,8",27.803392779469334]
["NRWIIIWeiblich55 und älterDeutscheKeine Berufsausbildung",8494,2531,"29,8",29.797504120555686]
["NRWIIIWeiblich55 und älterDeutscheBetriebliche/schulische Ausbildung",21761,6174,"28,4",28.371857910941596]
["NRWIIIWeiblich55 und älterDeutscheAkademische Ausbildung",4230,883,"20,9",20.874704491725769]
["NRWIIIWeiblich55 und älterAusländerInsgesamt",3781,807,"21,3",21.343559904787092]
["NRWIIIWeiblich55 und älterAusländerKeine Berufsausbildung",2549,564,"22,1",22.126324048646527]
["NRWIIIWeiblich55 und älterAusländerBetriebliche/schulische Ausbildung",835,182,"21,8",21.796407185628741]
["NRWIIIWeiblich55 und älterAusländerAkademische Ausbildung",397,61,"15,4",15.365239294710328]
["NRWIIInsgesamtInsgesamtInsgesamtInsgesamt",562220,123102,"21,9",21.89569919248693]
["NRWIIInsgesamtInsgesamtInsgesamtKeine Berufsausbildung",442789,95957,"21,7",21.671044221965765]
["NRWIIInsgesamtInsgesamtInsgesamtBetriebliche/schulische Ausbildung",91807,22078,"24,0",24.048275185987997]
["NRWIIInsgesamtInsgesamtInsgesamtAkademische Ausbildung",27624,5067,"18,3",18.342745438748914]
["NRWIIInsgesamtInsgesamtDeutscheInsgesamt",256562,59366,"23,1",23.139046312392324]
["NRWIIInsgesamtInsgesamtDeutscheKeine Berufsausbildung",176312,40404,"22,9",22.916194019692362]
["NRWIIInsgesamtInsgesamtDeutscheBetriebliche/schulische Ausbildung",71901,17337,"24,1",24.112321108190429]
["NRWIIInsgesamtInsgesamtDeutscheAkademische Ausbildung",8349,1625,"19,5",19.463408791472034]
["NRWIIInsgesamtInsgesamtAusländerInsgesamt",305652,63735,"20,9",20.852145577323231]
["NRWIIInsgesamtInsgesamtAusländerKeine Berufsausbildung",266471,55552,"20,8",20.847296703956527]
["NRWIIInsgesamtInsgesamtAusländerBetriebliche/schulische Ausbildung",19906,4741,"23,8",23.816939616196123]
["NRWIIInsgesamtInsgesamtAusländerAkademische Ausbildung",19275,3442,"17,9",17.857328145265889]
["NRWIIInsgesamt15 bis unter 25 JahreInsgesamtInsgesamt",95224,12534,"13,2",13.162648071914642]
["NRWIIInsgesamt15 bis unter 25 JahreInsgesamtKeine Berufsausbildung",90676,11981,"13,2",13.212978075786316]
["NRWIIInsgesamt15 bis unter 25 JahreInsgesamtBetriebliche/schulische Ausbildung",3433,429,"12,5",12.496358869793184]
["NRWIIInsgesamt15 bis unter 25 JahreInsgesamtAkademische Ausbildung",1115,124,"11,1",11.121076233183857]
["NRWIIInsgesamt15 bis unter 25 JahreDeutscheInsgesamt",46620,6837,"14,7",14.665379665379666]
["NRWIIInsgesamt15 bis unter 25 JahreDeutscheKeine Berufsausbildung",44059,6501,"14,8",14.755214598606415]
["NRWIIInsgesamt15 bis unter 25 JahreDeutscheBetriebliche/schulische Ausbildung",2316,312,"13,5",13.471502590673575]
["NRWIIInsgesamt15 bis unter 25 JahreDeutscheAkademische Ausbildung",245,24,"9,8",9.795918367346939]
["NRWIIInsgesamt15 bis unter 25 JahreAusländerInsgesamt",48604,5697,"11,7",11.721257509669986]
["NRWIIInsgesamt15 bis unter 25 JahreAusländerKeine Berufsausbildung",46617,5480,"11,8",11.755368213312741]
["NRWIIInsgesamt15 bis unter 25 JahreAusländerBetriebliche/schulische Ausbildung",1117,117,"10,5",10.474485228290064]
["NRWIIInsgesamt15 bis unter 25 JahreAusländerAkademische Ausbildung",870,100,"11,5",11.494252873563218]
["NRWIIInsgesamt25 bis unter 35 JahreInsgesamtInsgesamt",145723,32977,"22,6",22.629921151774258]
["NRWIIInsgesamt25 bis unter 35 JahreInsgesamtKeine Berufsausbildung",116495,26977,"23,2",23.157217047941973]
["NRWIIInsgesamt25 bis unter 35 JahreInsgesamtBetriebliche/schulische Ausbildung",20160,4715,"23,4",23.387896825396826]
["NRWIIInsgesamt25 bis unter 35 JahreInsgesamtAkademische Ausbildung",9068,1285,"14,2",14.170710189677987]
["NRWIIInsgesamt25 bis unter 35 JahreDeutscheInsgesamt",64099,16174,"25,2",25.232842946067802]
["NRWIIInsgesamt25 bis unter 35 JahreDeutscheKeine Berufsausbildung",45470,12093,"26,6",26.595557510446451]
["NRWIIInsgesamt25 bis unter 35 JahreDeutscheBetriebliche/schulische Ausbildung",15411,3679,"23,9",23.872558562066057]
["NRWIIInsgesamt25 bis unter 35 JahreDeutscheAkademische Ausbildung",3218,402,"12,5",12.492231199502797]
["NRWIIInsgesamt25 bis unter 35 JahreAusländerInsgesamt",81624,16803,"20,6",20.585857100852689]
["NRWIIInsgesamt25 bis unter 35 JahreAusländerKeine Berufsausbildung",71025,14884,"21,0",20.956001407954947]
["NRWIIInsgesamt25 bis unter 35 JahreAusländerBetriebliche/schulische Ausbildung",4749,1036,"21,8",21.815118972415245]
["NRWIIInsgesamt25 bis unter 35 JahreAusländerAkademische Ausbildung",5850,883,"15,1",15.094017094017095]
["NRWIIInsgesamt35 bis unter 45 JahreInsgesamtInsgesamt",141379,33835,"23,9",23.932125704666181]
["NRWIIInsgesamt35 bis unter 45 JahreInsgesamtKeine Berufsausbildung",107095,25683,"24,0",23.981511741911387]
["NRWIIInsgesamt35 bis unter 45 JahreInsgesamtBetriebliche/schulische Ausbildung",24577,6342,"25,8",25.804614070065508]
["NRWIIInsgesamt35 bis unter 45 JahreInsgesamtAkademische Ausbildung",9707,1810,"18,6",18.646337694447308]
["NRWIIInsgesamt35 bis unter 45 JahreDeutscheInsgesamt",54247,14459,"26,7",26.654008516599998]
["NRWIIInsgesamt35 bis unter 45 JahreDeutscheKeine Berufsausbildung",33692,9162,"27,2",27.193399026475127]
["NRWIIInsgesamt35 bis unter 45 JahreDeutscheBetriebliche/schulische Ausbildung",18326,4846,"26,4",26.443304594565099]
["NRWIIInsgesamt35 bis unter 45 JahreDeutscheAkademische Ausbildung",2229,451,"20,2",20.233288470165995]
["NRWIIInsgesamt35 bis unter 45 JahreAusländerInsgesamt",87130,19376,"22,2",22.238035119935727]
["NRWIIInsgesamt35 bis unter 45 JahreAusländerKeine Berufsausbildung",73401,16521,"22,5",22.507867740221524]
["NRWIIInsgesamt35 bis unter 45 JahreAusländerBetriebliche/schulische Ausbildung",6251,1496,"23,9",23.932170852663575]
["NRWIIInsgesamt35 bis unter 45 JahreAusländerAkademische Ausbildung",7478,1359,"18,2",18.173308371222252]
["NRWIIInsgesamt45 bis unter 55 JahreInsgesamtInsgesamt",107519,25719,"23,9",23.920423367032804]
["NRWIIInsgesamt45 bis unter 55 JahreInsgesamtKeine Berufsausbildung",78631,18949,"24,1",24.098637941778691]
["NRWIIInsgesamt45 bis unter 55 JahreInsgesamtBetriebliche/schulische Ausbildung",23993,5728,"23,9",23.873629808694201]
["NRWIIInsgesamt45 bis unter 55 JahreInsgesamtAkademische Ausbildung",4895,1042,"21,3",21.287027579162409]
["NRWIIInsgesamt45 bis unter 55 JahreDeutscheInsgesamt",48955,11815,"24,1",24.134409151261362]
["NRWIIInsgesamt45 bis unter 55 JahreDeutscheKeine Berufsausbildung",28942,7067,"24,4",24.417801119480341]
["NRWIIInsgesamt45 bis unter 55 JahreDeutscheBetriebliche/schulische Ausbildung",18648,4391,"23,5",23.546761046761048]
["NRWIIInsgesamt45 bis unter 55 JahreDeutscheAkademische Ausbildung",1365,357,"26,2",26.153846153846157]
["NRWIIInsgesamt45 bis unter 55 JahreAusländerInsgesamt",58560,13903,"23,7",23.741461748633881]
["NRWIIInsgesamt45 bis unter 55 JahreAusländerKeine Berufsausbildung",49685,11881,"23,9",23.912649693066317]
["NRWIIInsgesamt45 bis unter 55 JahreAusländerBetriebliche/schulische Ausbildung",5345,1337,"25,0",25.014031805425631]
["NRWIIInsgesamt45 bis unter 55 JahreAusländerAkademische Ausbildung",3530,685,"19,4",19.405099150141645]
["NRWIIInsgesamt55 und älterInsgesamtInsgesamt",72375,18037,"24,9",24.921588946459412]
["NRWIIInsgesamt55 und älterInsgesamtKeine Berufsausbildung",49892,12367,"24,8",24.787541088751706]
["NRWIIInsgesamt55 und älterInsgesamtBetriebliche/schulische Ausbildung",19644,4864,"24,8",24.760741193239667]
["NRWIIInsgesamt55 und älterInsgesamtAkademische Ausbildung",2839,806,"28,4",28.390278266995423]
["NRWIIInsgesamt55 und älterDeutscheInsgesamt",42641,10081,"23,6",23.641565629323892]
["NRWIIInsgesamt55 und älterDeutscheKeine Berufsausbildung",24149,5581,"23,1",23.110687813159966]
["NRWIIInsgesamt55 und älterDeutscheBetriebliche/schulische Ausbildung",17200,4109,"23,9",23.88953488372093]
["NRWIIInsgesamt55 und älterDeutscheAkademische Ausbildung",1292,391,"30,3",30.263157894736842]
["NRWIIInsgesamt55 und älterAusländerInsgesamt",29734,7956,"26,8",26.757247595345397]
["NRWIIInsgesamt55 und älterAusländerKeine Berufsausbildung",25743,6786,"26,4",26.360564036825547]
["NRWIIInsgesamt55 und älterAusländerBetriebliche/schulische Ausbildung",2444,755,"30,9",30.891980360065467]
["NRWIIInsgesamt55 und älterAusländerAkademische Ausbildung",1547,415,"26,8",26.82611506140918]
["NRWIIMännlichInsgesamtInsgesamtInsgesamt",276414,61230,"22,2",22.151555275781977]
["NRWIIMännlichInsgesamtInsgesamtKeine Berufsausbildung",214316,46489,"21,7",21.691800892140577]
["NRWIIMännlichInsgesamtInsgesamtBetriebliche/schulische Ausbildung",50252,12433,"24,7",24.741303828703334]
["NRWIIMännlichInsgesamtInsgesamtAkademische Ausbildung",11846,2308,"19,5",19.483369913894986]
["NRWIIMännlichInsgesamtDeutscheInsgesamt",137102,32516,"23,7",23.716648918323585]
["NRWIIMännlichInsgesamtDeutscheKeine Berufsausbildung",92349,21354,"23,1",23.123152389305783]
["NRWIIMännlichInsgesamtDeutscheBetriebliche/schulische Ausbildung",40475,10215,"25,2",25.237801111797403]
["NRWIIMännlichInsgesamtDeutscheAkademische Ausbildung",4278,947,"22,1",22.136512388966807]
["NRWIIMännlichInsgesamtAusländerInsgesamt",139310,28714,"20,6",20.611585672241763]
["NRWIIMännlichInsgesamtAusländerKeine Berufsausbildung",121965,25135,"20,6",20.608371254048294]
["NRWIIMännlichInsgesamtAusländerBetriebliche/schulische Ausbildung",9777,2218,"22,7",22.68589546895776]
["NRWIIMännlichInsgesamtAusländerAkademische Ausbildung",7568,1361,"18,0",17.983615221987314]
["NRWIIMännlich15 bis unter 25 JahreInsgesamtInsgesamt",51185,7013,"13,7",13.70127967177884]
["NRWIIMännlich15 bis unter 25 JahreInsgesamtKeine Berufsausbildung",49274,6770,"13,7",13.739497503754517]
["NRWIIMännlich15 bis unter 25 JahreInsgesamtBetriebliche/schulische Ausbildung",1588,202,"12,7",12.720403022670027]
["NRWIIMännlich15 bis unter 25 JahreInsgesamtAkademische Ausbildung",323,41,"12,7",12.693498452012383]
["NRWIIMännlich15 bis unter 25 JahreDeutscheInsgesamt",25266,3761,"14,9",14.885617034750256]
["NRWIIMännlich15 bis unter 25 JahreDeutscheKeine Berufsausbildung",24077,3603,"15,0",14.964488931345269]
["NRWIIMännlich15 bis unter 25 JahreDeutscheBetriebliche/schulische Ausbildung",1094,148,"13,5",13.528336380255942]
["NRWIIMännlich15 bis unter 25 JahreDeutscheAkademische Ausbildung","*","*","10,5",10.526315789473683]
["NRWIIMännlich15 bis unter 25 JahreAusländerInsgesamt",25919,3252,"12,5",12.546780354180331]
["NRWIIMännlich15 bis unter 25 JahreAusländerKeine Berufsausbildung",25197,3167,"12,6",12.568956621820057]
["NRWIIMännlich15 bis unter 25 JahreAusländerBetriebliche/schulische Ausbildung",494,54,"10,9",10.931174089068826]
["NRWIIMännlich15 bis unter 25 JahreAusländerAkademische Ausbildung","*","*","13,6",13.596491228070176]
["NRWIIMännlich25 bis unter 35 JahreInsgesamtInsgesamt",73989,16499,"22,3",22.299260700914999]
["NRWIIMännlich25 bis unter 35 JahreInsgesamtKeine Berufsausbildung",59194,13402,"22,6",22.640808190019261]
["NRWIIMännlich25 bis unter 35 JahreInsgesamtBetriebliche/schulische Ausbildung",10793,2528,"23,4",23.42258871490781]
["NRWIIMännlich25 bis unter 35 JahreInsgesamtAkademische Ausbildung",4002,569,"14,2",14.217891054472764]
["NRWIIMännlich25 bis unter 35 JahreDeutscheInsgesamt",34540,8657,"25,1",25.063694267515924]
["NRWIIMännlich25 bis unter 35 JahreDeutscheKeine Berufsausbildung",24573,6394,"26,0",26.020428926057054]
["NRWIIMännlich25 bis unter 35 JahreDeutscheBetriebliche/schulische Ausbildung",8421,2050,"24,3",24.343902149388434]
["NRWIIMännlich25 bis unter 35 JahreDeutscheAkademische Ausbildung","*","*","13,8",13.777490297542045]
["NRWIIMännlich25 bis unter 35 JahreAusländerInsgesamt",39449,7842,"19,9",19.878830895586709]
["NRWIIMännlich25 bis unter 35 JahreAusländerKeine Berufsausbildung",34621,7008,"20,2",20.242049623061149]
["NRWIIMännlich25 bis unter 35 JahreAusländerBetriebliche/schulische Ausbildung",2372,478,"20,2",20.151770657672849]
["NRWIIMännlich25 bis unter 35 JahreAusländerAkademische Ausbildung",2456,356,"14,5",14.495114006514658]
["NRWIIMännlich35 bis unter 45 JahreInsgesamtInsgesamt",64273,15722,"24,5",24.46128234250774]
["NRWIIMännlich35 bis unter 45 JahreInsgesamtKeine Berufsausbildung",47353,11516,"24,3",24.319472895064724]
["NRWIIMännlich35 bis unter 45 JahreInsgesamtBetriebliche/schulische Ausbildung",13029,3435,"26,4",26.364264333410087]
["NRWIIMännlich35 bis unter 45 JahreInsgesamtAkademische Ausbildung",3891,771,"19,8",19.814957594448728]
["NRWIIMännlich35 bis unter 45 JahreDeutscheInsgesamt",28497,7741,"27,2",27.164262904867183]
["NRWIIMännlich35 bis unter 45 JahreDeutscheKeine Berufsausbildung",17295,4713,"27,3",27.250650477016482]
["NRWIIMännlich35 bis unter 45 JahreDeutscheBetriebliche/schulische Ausbildung",10088,2761,"27,4",27.369151467089615]
["NRWIIMännlich35 bis unter 45 JahreDeutscheAkademische Ausbildung",1114,267,"24,0",23.967684021543985]
["NRWIIMännlich35 bis unter 45 JahreAusländerInsgesamt",35775,7981,"22,3",22.308874912648495]
["NRWIIMännlich35 bis unter 45 JahreAusländerKeine Berufsausbildung",30057,6803,"22,6",22.633662707522372]
["NRWIIMännlich35 bis unter 45 JahreAusländerBetriebliche/schulische Ausbildung",2941,674,"22,9",22.917375042502549]
["NRWIIMännlich35 bis unter 45 JahreAusländerAkademische Ausbildung",2777,504,"18,1",18.149081742888011]
["NRWIIMännlich45 bis unter 55 JahreInsgesamtInsgesamt",51175,12788,"25,0",24.988764044943821]
["NRWIIMännlich45 bis unter 55 JahreInsgesamtKeine Berufsausbildung",35389,8916,"25,2",25.194269405747548]
["NRWIIMännlich45 bis unter 55 JahreInsgesamtBetriebliche/schulische Ausbildung",13602,3376,"24,8",24.819879429495661]
["NRWIIMännlich45 bis unter 55 JahreInsgesamtAkademische Ausbildung",2184,496,"22,7",22.710622710622712]
["NRWIIMännlich45 bis unter 55 JahreDeutscheInsgesamt",26055,6691,"25,7",25.680291690654382]
["NRWIIMännlich45 bis unter 55 JahreDeutscheKeine Berufsausbildung",14395,3751,"26,1",26.057658909343523]
["NRWIIMännlich45 bis unter 55 JahreDeutscheBetriebliche/schulische Ausbildung",10888,2725,"25,0",25.027553269654668]
["NRWIIMännlich45 bis unter 55 JahreDeutscheAkademische Ausbildung",772,215,"27,8",27.849740932642487]
["NRWIIMännlich45 bis unter 55 JahreAusländerInsgesamt",25119,6097,"24,3",24.272463075759383]
["NRWIIMännlich45 bis unter 55 JahreAusländerKeine Berufsausbildung",20993,5165,"24,6",24.603439241651976]
["NRWIIMännlich45 bis unter 55 JahreAusländerBetriebliche/schulische Ausbildung",2714,651,"24,0",23.986735445836405]
["NRWIIMännlich45 bis unter 55 JahreAusländerAkademische Ausbildung",1412,281,"19,9",19.900849858356938]
["NRWIIMännlich55 und älterInsgesamtInsgesamt",35792,9208,"25,7",25.72641931157801]
["NRWIIMännlich55 und älterInsgesamtKeine Berufsausbildung",23106,5885,"25,5",25.469575002163943]
["NRWIIMännlich55 und älterInsgesamtBetriebliche/schulische Ausbildung",11240,2892,"25,7",25.729537366548044]
["NRWIIMännlich55 und älterInsgesamtAkademische Ausbildung",1446,431,"29,8",29.806362378976488]
["NRWIIMännlich55 und älterDeutscheInsgesamt",22744,5666,"24,9",24.912064720365812]
["NRWIIMännlich55 und älterDeutscheKeine Berufsausbildung",12009,2893,"24,1",24.090265634107752]
["NRWIIMännlich55 und älterDeutscheBetriebliche/schulische Ausbildung",9984,2531,"25,4",25.350560897435898]
["NRWIIMännlich55 und älterDeutscheAkademische Ausbildung",751,242,"32,2",32.223701731025301]
["NRWIIMännlich55 und älterAusländerInsgesamt",13048,3542,"27,1",27.145922746781114]
["NRWIIMännlich55 und älterAusländerKeine Berufsausbildung",11097,2992,"27,0",26.962242047400199]
["NRWIIMännlich55 und älterAusländerBetriebliche/schulische Ausbildung",1256,361,"28,7",28.742038216560513]
["NRWIIMännlich55 und älterAusländerAkademische Ausbildung",695,189,"27,2",27.194244604316548]
["NRWIIWeiblichInsgesamtInsgesamtInsgesamt",285802,61872,"21,6",21.648553893954556]
["NRWIIWeiblichInsgesamtInsgesamtKeine Berufsausbildung",228469,49468,"21,7",21.651952781340139]
["NRWIIWeiblichInsgesamtInsgesamtBetriebliche/schulische Ausbildung",41555,9645,"23,2",23.210203344964505]
["NRWIIWeiblichInsgesamtInsgesamtAkademische Ausbildung",15778,2759,"17,5",17.486373431360121]
["NRWIIWeiblichInsgesamtDeutscheInsgesamt",119460,26850,"22,5",22.476142641888497]
["NRWIIWeiblichInsgesamtDeutscheKeine Berufsausbildung",83963,19050,"22,7",22.688565201338683]
["NRWIIWeiblichInsgesamtDeutscheBetriebliche/schulische Ausbildung",31426,7122,"22,7",22.662763316998664]
["NRWIIWeiblichInsgesamtDeutscheAkademische Ausbildung",4071,678,"16,7",16.654384672070744]
["NRWIIWeiblichInsgesamtAusländerInsgesamt",166338,35021,"21,1",21.054118722120023]
["NRWIIWeiblichInsgesamtAusländerKeine Berufsausbildung",144502,30417,"21,0",21.049535646565445]
["NRWIIWeiblichInsgesamtAusländerBetriebliche/schulische Ausbildung",10129,2523,"24,9",24.908678053114819]
["NRWIIWeiblichInsgesamtAusländerAkademische Ausbildung",11707,2081,"17,8",17.775689758264289]
["NRWIIWeiblich15 bis unter 25 JahreInsgesamtInsgesamt",44038,5521,"12,5",12.536899950043146]
["NRWIIWeiblich15 bis unter 25 JahreInsgesamtKeine Berufsausbildung",41401,5211,"12,6",12.586652496316514]
["NRWIIWeiblich15 bis unter 25 JahreInsgesamtBetriebliche/schulische Ausbildung",1845,227,"12,3",12.303523035230352]
["NRWIIWeiblich15 bis unter 25 JahreInsgesamtAkademische Ausbildung",792,83,"10,5",10.479797979797979]
["NRWIIWeiblich15 bis unter 25 JahreDeutscheInsgesamt",21354,3076,"14,4",14.404795354500328]
["NRWIIWeiblich15 bis unter 25 JahreDeutscheKeine Berufsausbildung",19982,2898,"14,5",14.503052747472726]
["NRWIIWeiblich15 bis unter 25 JahreDeutscheBetriebliche/schulische Ausbildung",1222,164,"13,4",13.420621931260229]
["NRWIIWeiblich15 bis unter 25 JahreDeutscheAkademische Ausbildung","*","*","9,3",9.3333333333333339]
["NRWIIWeiblich15 bis unter 25 JahreAusländerInsgesamt",22684,2445,"10,8",10.778522306471523]
["NRWIIWeiblich15 bis unter 25 JahreAusländerKeine Berufsausbildung",21419,2313,"10,8",10.798823474485269]
["NRWIIWeiblich15 bis unter 25 JahreAusländerBetriebliche/schulische Ausbildung",623,63,"10,1",10.112359550561797]
["NRWIIWeiblich15 bis unter 25 JahreAusländerAkademische Ausbildung","*","*","10,7",10.747663551401869]
["NRWIIWeiblich25 bis unter 35 JahreInsgesamtInsgesamt",71732,16478,"23,0",22.971616572798752]
["NRWIIWeiblich25 bis unter 35 JahreInsgesamtKeine Berufsausbildung",57299,13575,"23,7",23.691512940889019]
["NRWIIWeiblich25 bis unter 35 JahreInsgesamtBetriebliche/schulische Ausbildung",9367,2187,"23,3",23.347923561439092]
["NRWIIWeiblich25 bis unter 35 JahreInsgesamtAkademische Ausbildung",5066,716,"14,1",14.133438610343466]
["NRWIIWeiblich25 bis unter 35 JahreDeutscheInsgesamt",29559,7517,"25,4",25.430494942318756]
["NRWIIWeiblich25 bis unter 35 JahreDeutscheKeine Berufsausbildung",20897,5699,"27,3",27.271857204383405]
["NRWIIWeiblich25 bis unter 35 JahreDeutscheBetriebliche/schulische Ausbildung",6990,1629,"23,3",23.30472103004292]
["NRWIIWeiblich25 bis unter 35 JahreDeutscheAkademische Ausbildung","*","*","11,3",11.303827751196172]
["NRWIIWeiblich25 bis unter 35 JahreAusländerInsgesamt",42173,8961,"21,2",21.248191971166385]
["NRWIIWeiblich25 bis unter 35 JahreAusländerKeine Berufsausbildung",36402,7876,"21,6",21.636173836602385]
["NRWIIWeiblich25 bis unter 35 JahreAusländerBetriebliche/schulische Ausbildung",2377,558,"23,5",23.474968447623056]
["NRWIIWeiblich25 bis unter 35 JahreAusländerAkademische Ausbildung",3394,527,"15,5",15.527401296405422]
["NRWIIWeiblich35 bis unter 45 JahreInsgesamtInsgesamt",77105,18113,"23,5",23.491342973866804]
["NRWIIWeiblich35 bis unter 45 JahreInsgesamtKeine Berufsausbildung",59741,14167,"23,7",23.714032239165732]
["NRWIIWeiblich35 bis unter 45 JahreInsgesamtBetriebliche/schulische Ausbildung",11548,2907,"25,2",25.173190162798754]
["NRWIIWeiblich35 bis unter 45 JahreInsgesamtAkademische Ausbildung",5816,1039,"17,9",17.864511691884459]
["NRWIIWeiblich35 bis unter 45 JahreDeutscheInsgesamt",25750,6718,"26,1",26.089320388349513]
["NRWIIWeiblich35 bis unter 45 JahreDeutscheKeine Berufsausbildung",16397,4449,"27,1",27.133012136366407]
["NRWIIWeiblich35 bis unter 45 JahreDeutscheBetriebliche/schulische Ausbildung",8238,2085,"25,3",25.309541150764748]
["NRWIIWeiblich35 bis unter 45 JahreDeutscheAkademische Ausbildung",1115,184,"16,5",16.502242152466369]
["NRWIIWeiblich35 bis unter 45 JahreAusländerInsgesamt",51354,11395,"22,2",22.189118666510886]
["NRWIIWeiblich35 bis unter 45 JahreAusländerKeine Berufsausbildung",43343,9718,"22,4",22.421152204508225]
["NRWIIWeiblich35 bis unter 45 JahreAusländerBetriebliche/schulische Ausbildung",3310,822,"24,8",24.833836858006041]
["NRWIIWeiblich35 bis unter 45 JahreAusländerAkademische Ausbildung",4701,855,"18,2",18.187619655392471]
["NRWIIWeiblich45 bis unter 55 JahreInsgesamtInsgesamt",56344,12931,"23,0",22.950092290217235]
["NRWIIWeiblich45 bis unter 55 JahreInsgesamtKeine Berufsausbildung",43242,10033,"23,2",23.20197955691226]
["NRWIIWeiblich45 bis unter 55 JahreInsgesamtBetriebliche/schulische Ausbildung",10391,2352,"22,6",22.634972572418437]
["NRWIIWeiblich45 bis unter 55 JahreInsgesamtAkademische Ausbildung",2711,546,"20,1",20.140169679085211]
["NRWIIWeiblich45 bis unter 55 JahreDeutscheInsgesamt",22900,5124,"22,4",22.375545851528383]
["NRWIIWeiblich45 bis unter 55 JahreDeutscheKeine Berufsausbildung",14547,3316,"22,8",22.795078022960062]
["NRWIIWeiblich45 bis unter 55 JahreDeutscheBetriebliche/schulische Ausbildung",7760,1666,"21,5",21.469072164948454]
["NRWIIWeiblich45 bis unter 55 JahreDeutscheAkademische Ausbildung",593,142,"23,9",23.946037099494095]
["NRWIIWeiblich45 bis unter 55 JahreAusländerInsgesamt",33441,7806,"23,3",23.342603391046918]
["NRWIIWeiblich45 bis unter 55 JahreAusländerKeine Berufsausbildung",28692,6716,"23,4",23.407221525163809]
["NRWIIWeiblich45 bis unter 55 JahreAusländerBetriebliche/schulische Ausbildung",2631,686,"26,1",26.073736221968836]
["NRWIIWeiblich45 bis unter 55 JahreAusländerAkademische Ausbildung",2118,404,"19,1",19.074598677998111]
["NRWIIWeiblich55 und älterInsgesamtInsgesamt",36583,8829,"24,1",24.134160675723699]
["NRWIIWeiblich55 und älterInsgesamtKeine Berufsausbildung",26786,6482,"24,2",24.199208541775555]
["NRWIIWeiblich55 und älterInsgesamtBetriebliche/schulische Ausbildung",8404,1972,"23,5",23.465016658733937]
["NRWIIWeiblich55 und älterInsgesamtAkademische Ausbildung",1393,375,"26,9",26.920315865039484]
["NRWIIWeiblich55 und älterDeutscheInsgesamt",19897,4415,"22,2",22.189274765039958]
["NRWIIWeiblich55 und älterDeutscheKeine Berufsausbildung",12140,2688,"22,1",22.141680395387151]
["NRWIIWeiblich55 und älterDeutscheBetriebliche/schulische Ausbildung",7216,1578,"21,9",21.868070953436806]
["NRWIIWeiblich55 und älterDeutscheAkademische Ausbildung",541,149,"27,5",27.541589648798521]
["NRWIIWeiblich55 und älterAusländerInsgesamt",16686,4414,"26,5",26.453314155579527]
["NRWIIWeiblich55 und älterAusländerKeine Berufsausbildung",14646,3794,"25,9",25.904683872729755]
["NRWIIWeiblich55 und älterAusländerBetriebliche/schulische Ausbildung",1188,394,"33,2",33.164983164983163]
["NRWIIWeiblich55 und älterAusländerAkademische Ausbildung",852,226,"26,5",26.525821596244132]
["NDInsgesamtInsgesamtInsgesamtInsgesamtInsgesamt",800688,117407,"14,7",14.663264592450492]
["NDInsgesamtInsgesamtInsgesamtInsgesamtKeine Berufsausbildung",451137,72892,"16,2",16.157397863620144]
["NDInsgesamtInsgesamtInsgesamtInsgesamtBetriebliche/schulische Ausbildung",262690,34833,"13,3",13.260116487114088]
["NDInsgesamtInsgesamtInsgesamtInsgesamtAkademische Ausbildung",86861,9682,"11,1",11.146544479110302]
["NDInsgesamtInsgesamtInsgesamtDeutscheInsgesamt",502458,70372,"14,0",14.005548722480288]
["NDInsgesamtInsgesamtInsgesamtDeutscheKeine Berufsausbildung",213050,34855,"16,4",16.360009387467731]
["NDInsgesamtInsgesamtInsgesamtDeutscheBetriebliche/schulische Ausbildung",231366,29925,"12,9",12.934052540131221]
["NDInsgesamtInsgesamtInsgesamtDeutscheAkademische Ausbildung",58042,5592,"9,6",9.6344026739257771]
["NDInsgesamtInsgesamtInsgesamtAusländerInsgesamt",298224,47035,"15,8",15.771701808036912]
["NDInsgesamtInsgesamtInsgesamtAusländerKeine Berufsausbildung",238082,38037,"16,0",15.976428289412892]
["NDInsgesamtInsgesamtInsgesamtAusländerBetriebliche/schulische Ausbildung",31323,4908,"15,7",15.668997222488269]
["NDInsgesamtInsgesamtInsgesamtAusländerAkademische Ausbildung",28819,4090,"14,2",14.192026093896388]
["NDInsgesamtInsgesamt15 bis unter 25 JahreInsgesamtInsgesamt",137267,9527,"6,9",6.9404882455360726]
["NDInsgesamtInsgesamt15 bis unter 25 JahreInsgesamtKeine Berufsausbildung",99495,8174,"8,2",8.2154882154882163]
["NDInsgesamtInsgesamt15 bis unter 25 JahreInsgesamtBetriebliche/schulische Ausbildung",35036,1250,"3,6",3.5677588765840853]
["NDInsgesamtInsgesamt15 bis unter 25 JahreInsgesamtAkademische Ausbildung",2736,103,"3,8",3.7646198830409356]
["NDInsgesamtInsgesamt15 bis unter 25 JahreDeutscheInsgesamt",90227,5982,"6,6",6.6299444733837989]
["NDInsgesamtInsgesamt15 bis unter 25 JahreDeutscheKeine Berufsausbildung",57195,4922,"8,6",8.605647346796049]
["NDInsgesamtInsgesamt15 bis unter 25 JahreDeutscheBetriebliche/schulische Ausbildung",31293,1027,"3,3",3.2818841274406414]
["NDInsgesamtInsgesamt15 bis unter 25 JahreDeutscheAkademische Ausbildung",1739,33,"1,9",1.8976423231742381]
["NDInsgesamtInsgesamt15 bis unter 25 JahreAusländerInsgesamt",47039,3545,"7,5",7.5362996662344015]
["NDInsgesamtInsgesamt15 bis unter 25 JahreAusländerKeine Berufsausbildung",42299,3252,"7,7",7.6881250147757623]
["NDInsgesamtInsgesamt15 bis unter 25 JahreAusländerBetriebliche/schulische Ausbildung",3743,223,"6,0",5.9577878706919583]
["NDInsgesamtInsgesamt15 bis unter 25 JahreAusländerAkademische Ausbildung",997,70,"7,0",7.0210631895687063]
["NDInsgesamtInsgesamt25 bis unter 35 JahreInsgesamtInsgesamt",215567,28814,"13,4",13.366609917102339]
["NDInsgesamtInsgesamt25 bis unter 35 JahreInsgesamtKeine Berufsausbildung",117365,19977,"17,0",17.021258467175052]
["NDInsgesamtInsgesamt25 bis unter 35 JahreInsgesamtBetriebliche/schulische Ausbildung",65654,6595,"10,0",10.045084838699852]
["NDInsgesamtInsgesamt25 bis unter 35 JahreInsgesamtAkademische Ausbildung",32548,2242,"6,9",6.8882880668551065]
["NDInsgesamtInsgesamt25 bis unter 35 JahreDeutscheInsgesamt",129894,16054,"12,4",12.359308359123593]
["NDInsgesamtInsgesamt25 bis unter 35 JahreDeutscheKeine Berufsausbildung",51212,9648,"18,8",18.839334530969303]
["NDInsgesamtInsgesamt25 bis unter 35 JahreDeutscheBetriebliche/schulische Ausbildung",56690,5380,"9,5",9.4902099135650015]
["NDInsgesamtInsgesamt25 bis unter 35 JahreDeutscheAkademische Ausbildung",21992,1026,"4,7",4.6653328483084762]
["NDInsgesamtInsgesamt25 bis unter 35 JahreAusländerInsgesamt",85672,12760,"14,9",14.894014380427677]
["NDInsgesamtInsgesamt25 bis unter 35 JahreAusländerKeine Berufsausbildung",66152,10329,"15,6",15.614040391824888]
["NDInsgesamtInsgesamt25 bis unter 35 JahreAusländerBetriebliche/schulische Ausbildung",8964,1215,"13,6",13.554216867469879]
["NDInsgesamtInsgesamt25 bis unter 35 JahreAusländerAkademische Ausbildung",10556,1216,"11,5",11.51951496779083]
["NDInsgesamtInsgesamt35 bis unter 45 JahreInsgesamtInsgesamt",181206,28648,"15,8",15.809631027670164]
["NDInsgesamtInsgesamt35 bis unter 45 JahreInsgesamtKeine Berufsausbildung",100873,18653,"18,5",18.491568606069016]
["NDInsgesamtInsgesamt35 bis unter 45 JahreInsgesamtBetriebliche/schulische Ausbildung",54531,7151,"13,1",13.113641781738828]
["NDInsgesamtInsgesamt35 bis unter 45 JahreInsgesamtAkademische Ausbildung",25802,2844,"11,0",11.02240136423533]
["NDInsgesamtInsgesamt35 bis unter 45 JahreDeutscheInsgesamt",98106,14176,"14,4",14.449676880109269]
["NDInsgesamtInsgesamt35 bis unter 45 JahreDeutscheKeine Berufsausbildung",37245,7275,"19,5",19.532823197744666]
["NDInsgesamtInsgesamt35 bis unter 45 JahreDeutscheBetriebliche/schulische Ausbildung",46025,5667,"12,3",12.312873438348722]
["NDInsgesamtInsgesamt35 bis unter 45 JahreDeutscheAkademische Ausbildung",14836,1234,"8,3",8.3176058236721495]
["NDInsgesamtInsgesamt35 bis unter 45 JahreAusländerInsgesamt",83100,14472,"17,4",17.415162454873645]
["NDInsgesamtInsgesamt35 bis unter 45 JahreAusländerKeine Berufsausbildung",63628,11378,"17,9",17.882064499905702]
["NDInsgesamtInsgesamt35 bis unter 45 JahreAusländerBetriebliche/schulische Ausbildung",8506,1484,"17,4",17.446508347049143]
["NDInsgesamtInsgesamt35 bis unter 45 JahreAusländerAkademische Ausbildung",10966,1610,"14,7",14.681743571037753]
["NDInsgesamtInsgesamt45 bis unter 55 JahreInsgesamtInsgesamt",141747,21916,"15,5",15.461350152031436]
["NDInsgesamtInsgesamt45 bis unter 55 JahreInsgesamtKeine Berufsausbildung",75190,13428,"17,9",17.858757813539032]
["NDInsgesamtInsgesamt45 bis unter 55 JahreInsgesamtBetriebliche/schulische Ausbildung",52944,6826,"12,9",12.892867935932307]
["NDInsgesamtInsgesamt45 bis unter 55 JahreInsgesamtAkademische Ausbildung",13613,1662,"12,2",12.208917946080952]
["NDInsgesamtInsgesamt45 bis unter 55 JahreDeutscheInsgesamt",88328,12076,"13,7",13.671768861516167]
["NDInsgesamtInsgesamt45 bis unter 55 JahreDeutscheKeine Berufsausbildung",32863,5453,"16,6",16.593129050908317]
["NDInsgesamtInsgesamt45 bis unter 55 JahreDeutscheBetriebliche/schulische Ausbildung",46213,5679,"12,3",12.288749918854002]
["NDInsgesamtInsgesamt45 bis unter 55 JahreDeutscheAkademische Ausbildung",9252,944,"10,2",10.203199308257673]
["NDInsgesamtInsgesamt45 bis unter 55 JahreAusländerInsgesamt",53416,9840,"18,4",18.421446757525835]
["NDInsgesamtInsgesamt45 bis unter 55 JahreAusländerKeine Berufsausbildung",42325,7975,"18,8",18.842291789722388]
["NDInsgesamtInsgesamt45 bis unter 55 JahreAusländerBetriebliche/schulische Ausbildung",6730,1147,"17,0",17.043090638930163]
["NDInsgesamtInsgesamt45 bis unter 55 JahreAusländerAkademische Ausbildung",4361,718,"16,5",16.464113735381794]
["NDInsgesamtInsgesamt55 und älterInsgesamtInsgesamt",124901,28502,"22,8",22.819673181159477]
["NDInsgesamtInsgesamt55 und älterInsgesamtKeine Berufsausbildung",58214,12660,"21,7",21.747345999244168]
["NDInsgesamtInsgesamt55 und älterInsgesamtBetriebliche/schulische Ausbildung",54525,13011,"23,9",23.862448418156809]
["NDInsgesamtInsgesamt55 und älterInsgesamtAkademische Ausbildung",12162,2831,"23,3",23.277421476730801]
["NDInsgesamtInsgesamt55 und älterDeutscheInsgesamt",95903,22084,"23,0",23.027433969740258]
["NDInsgesamtInsgesamt55 und älterDeutscheKeine Berufsausbildung",34535,7557,"21,9",21.882148544954394]
["NDInsgesamtInsgesamt55 und älterDeutscheBetriebliche/schulische Ausbildung",51145,12172,"23,8",23.799002835076742]
["NDInsgesamtInsgesamt55 und älterDeutscheAkademische Ausbildung",10223,2355,"23,0",23.036290717010662]
["NDInsgesamtInsgesamt55 und älterAusländerInsgesamt",28997,6418,"22,1",22.133324136979688]
["NDInsgesamtInsgesamt55 und älterAusländerKeine Berufsausbildung",23678,5103,"21,6",21.551651321902188]
["NDInsgesamtInsgesamt55 und älterAusländerBetriebliche/schulische Ausbildung",3380,839,"24,8",24.822485207100591]
["NDInsgesamtInsgesamt55 und älterAusländerAkademische Ausbildung",1939,476,"24,5",24.548736462093864]
["NDInsgesamtMännlichInsgesamtInsgesamtInsgesamt",417539,61900,"14,8",14.824962458596683]
["NDInsgesamtMännlichInsgesamtInsgesamtKeine Berufsausbildung",237924,37861,"15,9",15.913064676115063]
["NDInsgesamtMännlichInsgesamtInsgesamtBetriebliche/schulische Ausbildung",141533,19419,"13,7",13.720475083549418]
["NDInsgesamtMännlichInsgesamtInsgesamtAkademische Ausbildung",38082,4620,"12,1",12.131715771230503]
["NDInsgesamtMännlichInsgesamtDeutscheInsgesamt",270209,39790,"14,7",14.725638302203109]
["NDInsgesamtMännlichInsgesamtDeutscheKeine Berufsausbildung",118494,19561,"16,5",16.508008844329673]
["NDInsgesamtMännlichInsgesamtDeutscheBetriebliche/schulische Ausbildung",125044,17083,"13,7",13.661591119925786]
["NDInsgesamtMännlichInsgesamtDeutscheAkademische Ausbildung",26671,3146,"11,8",11.795583217727119]
["NDInsgesamtMännlichInsgesamtAusländerInsgesamt",147326,22110,"15,0",15.007534311662571]
["NDInsgesamtMännlichInsgesamtAusländerKeine Berufsausbildung",119427,18300,"15,3",15.323168127810295]
["NDInsgesamtMännlichInsgesamtAusländerBetriebliche/schulische Ausbildung",16488,2336,"14,2",14.167879670063076]
["NDInsgesamtMännlichInsgesamtAusländerAkademische Ausbildung",11411,1474,"12,9",12.917360441679083]
["NDInsgesamtMännlich15 bis unter 25 JahreInsgesamtInsgesamt",78813,5594,"7,1",7.0978138124421095]
["NDInsgesamtMännlich15 bis unter 25 JahreInsgesamtKeine Berufsausbildung",57808,4821,"8,3",8.3396761693883192]
["NDInsgesamtMännlich15 bis unter 25 JahreInsgesamtBetriebliche/schulische Ausbildung",20113,747,"3,7",3.7140158106697165]
["NDInsgesamtMännlich15 bis unter 25 JahreInsgesamtAkademische Ausbildung",892,26,"2,9",2.9147982062780269]
["NDInsgesamtMännlich15 bis unter 25 JahreDeutscheInsgesamt",51789,3461,"6,7",6.6828863272123424]
["NDInsgesamtMännlich15 bis unter 25 JahreDeutscheKeine Berufsausbildung",33197,2817,"8,5",8.4857065397475679]
["NDInsgesamtMännlich15 bis unter 25 JahreDeutscheBetriebliche/schulische Ausbildung",17987,636,"3,5",3.5358870295213207]
["NDInsgesamtMännlich15 bis unter 25 JahreDeutscheAkademische Ausbildung",605,8,"1,3",1.3223140495867769]
["NDInsgesamtMännlich15 bis unter 25 JahreAusländerInsgesamt",27023,2133,"7,9",7.8932760981386227]
["NDInsgesamtMännlich15 bis unter 25 JahreAusländerKeine Berufsausbildung",24610,2004,"8,1",8.1430312880942708]
["NDInsgesamtMännlich15 bis unter 25 JahreAusländerBetriebliche/schulische Ausbildung",2126,111,"5,2",5.2210724365004708]
["NDInsgesamtMännlich15 bis unter 25 JahreAusländerAkademische Ausbildung",287,18,"6,3",6.2717770034843205]
["NDInsgesamtMännlich25 bis unter 35 JahreInsgesamtInsgesamt",116639,15295,"13,1",13.113109680295612]
["NDInsgesamtMännlich25 bis unter 35 JahreInsgesamtKeine Berufsausbildung",66145,10813,"16,3",16.347418550154963]
["NDInsgesamtMännlich25 bis unter 35 JahreInsgesamtBetriebliche/schulische Ausbildung",36988,3550,"9,6",9.597707364550665]
["NDInsgesamtMännlich25 bis unter 35 JahreInsgesamtAkademische Ausbildung",13506,932,"6,9",6.9006367540352445]
["NDInsgesamtMännlich25 bis unter 35 JahreDeutscheInsgesamt",71151,8933,"12,6",12.554988686033926]
["NDInsgesamtMännlich25 bis unter 35 JahreDeutscheKeine Berufsausbildung",30144,5465,"18,1",18.129644373673038]
["NDInsgesamtMännlich25 bis unter 35 JahreDeutscheBetriebliche/schulische Ausbildung",31849,2966,"9,3",9.3126942761154208]
["NDInsgesamtMännlich25 bis unter 35 JahreDeutscheAkademische Ausbildung",9158,502,"5,5",5.4815461891242627]
["NDInsgesamtMännlich25 bis unter 35 JahreAusländerInsgesamt",45487,6362,"14,0",13.986413700617758]
["NDInsgesamtMännlich25 bis unter 35 JahreAusländerKeine Berufsausbildung",36000,5348,"14,9",14.855555555555554]
["NDInsgesamtMännlich25 bis unter 35 JahreAusländerBetriebliche/schulische Ausbildung",5139,584,"11,4",11.364078614516442]
["NDInsgesamtMännlich25 bis unter 35 JahreAusländerAkademische Ausbildung",4348,430,"9,9",9.8896044158233671]
["NDInsgesamtMännlich35 bis unter 45 JahreInsgesamtInsgesamt",89310,14164,"15,9",15.859366252379353]
["NDInsgesamtMännlich35 bis unter 45 JahreInsgesamtKeine Berufsausbildung",50005,9211,"18,4",18.42015798420158]
["NDInsgesamtMännlich35 bis unter 45 JahreInsgesamtBetriebliche/schulische Ausbildung",28604,3823,"13,4",13.365263599496574]
["NDInsgesamtMännlich35 bis unter 45 JahreInsgesamtAkademische Ausbildung",10701,1130,"10,6",10.559760770021494]
["NDInsgesamtMännlich35 bis unter 45 JahreDeutscheInsgesamt",51596,7899,"15,3",15.309326304364678]
["NDInsgesamtMännlich35 bis unter 45 JahreDeutscheKeine Berufsausbildung",20721,4163,"20,1",20.09072921191062]
["NDInsgesamtMännlich35 bis unter 45 JahreDeutscheBetriebliche/schulische Ausbildung",24420,3151,"12,9",12.903357903357904]
["NDInsgesamtMännlich35 bis unter 45 JahreDeutscheAkademische Ausbildung",6455,585,"9,1",9.0627420604182802]
["NDInsgesamtMännlich35 bis unter 45 JahreAusländerInsgesamt",37714,6265,"16,6",16.611868271729332]
["NDInsgesamtMännlich35 bis unter 45 JahreAusländerKeine Berufsausbildung",29284,5048,"17,2",17.238082229203659]
["NDInsgesamtMännlich35 bis unter 45 JahreAusländerBetriebliche/schulische Ausbildung",4184,672,"16,1",16.061185468451242]
["NDInsgesamtMännlich35 bis unter 45 JahreAusländerAkademische Ausbildung",4246,545,"12,8",12.835609985869054]
["NDInsgesamtMännlich45 bis unter 55 JahreInsgesamtInsgesamt",69101,11280,"16,3",16.323931636300486]
["NDInsgesamtMännlich45 bis unter 55 JahreInsgesamtKeine Berufsausbildung",35745,6596,"18,5",18.452930479787383]
["NDInsgesamtMännlich45 bis unter 55 JahreInsgesamtBetriebliche/schulische Ausbildung",27125,3886,"14,3",14.326267281105991]
["NDInsgesamtMännlich45 bis unter 55 JahreInsgesamtAkademische Ausbildung",6231,798,"12,8",12.806933076552721]
["NDInsgesamtMännlich45 bis unter 55 JahreDeutscheInsgesamt",45295,6890,"15,2",15.211391985870403]
["NDInsgesamtMännlich45 bis unter 55 JahreDeutscheKeine Berufsausbildung",16828,3032,"18,0",18.017589731400047]
["NDInsgesamtMännlich45 bis unter 55 JahreDeutscheBetriebliche/schulische Ausbildung",23921,3333,"13,9",13.933363989799757]
["NDInsgesamtMännlich45 bis unter 55 JahreDeutscheAkademische Ausbildung",4546,525,"11,5",11.548614166300045]
["NDInsgesamtMännlich45 bis unter 55 JahreAusländerInsgesamt",23805,4390,"18,4",18.441503885738289]
["NDInsgesamtMännlich45 bis unter 55 JahreAusländerKeine Berufsausbildung",18917,3564,"18,8",18.840196648517207]
["NDInsgesamtMännlich45 bis unter 55 JahreAusländerBetriebliche/schulische Ausbildung",3203,553,"17,3",17.26506400249766]
["NDInsgesamtMännlich45 bis unter 55 JahreAusländerAkademische Ausbildung",1685,273,"16,2",16.201780415430267]
["NDInsgesamtMännlich55 und älterInsgesamtInsgesamt",63676,15567,"24,4",24.447201457377975]
["NDInsgesamtMännlich55 und älterInsgesamtKeine Berufsausbildung",28221,6420,"22,7",22.749016689699161]
["NDInsgesamtMännlich55 und älterInsgesamtBetriebliche/schulische Ausbildung",28703,7413,"25,8",25.826568651360489]
["NDInsgesamtMännlich55 und älterInsgesamtAkademische Ausbildung",6752,1734,"25,7",25.681279620853083]
["NDInsgesamtMännlich55 und älterDeutscheInsgesamt",50378,12607,"25,0",25.024812418119019]
["NDInsgesamtMännlich55 und älterDeutscheKeine Berufsausbildung",17604,4084,"23,2",23.199272892524426]
["NDInsgesamtMännlich55 und älterDeutscheBetriebliche/schulische Ausbildung",26867,6997,"26,0",26.043101202218331]
["NDInsgesamtMännlich55 und älterDeutscheAkademische Ausbildung",5907,1526,"25,8",25.833756560013544]
["NDInsgesamtMännlich55 und älterAusländerInsgesamt",13297,2960,"22,3",22.260660299315635]
["NDInsgesamtMännlich55 und älterAusländerKeine Berufsausbildung",10616,2336,"22,0",22.004521477015825]
["NDInsgesamtMännlich55 und älterAusländerBetriebliche/schulische Ausbildung",1836,416,"22,7",22.657952069716774]
["NDInsgesamtMännlich55 und älterAusländerAkademische Ausbildung",845,208,"24,6",24.615384615384617]
["NDInsgesamtWeiblichInsgesamtInsgesamtInsgesamt",383141,55507,"14,5",14.4873558298381]
["NDInsgesamtWeiblichInsgesamtInsgesamtKeine Berufsausbildung",213208,35031,"16,4",16.430434130051406]
["NDInsgesamtWeiblichInsgesamtInsgesamtBetriebliche/schulische Ausbildung",121155,15414,"12,7",12.722545499566671]
["NDInsgesamtWeiblichInsgesamtInsgesamtAkademische Ausbildung",48778,5062,"10,4",10.377629259092213]
["NDInsgesamtWeiblichInsgesamtDeutscheInsgesamt",232242,30582,"13,2",13.168160797788515]
["NDInsgesamtWeiblichInsgesamtDeutscheKeine Berufsausbildung",94551,15294,"16,2",16.17539740457531]
["NDInsgesamtWeiblichInsgesamtDeutscheBetriebliche/schulische Ausbildung",106321,12842,"12,1",12.078516943971557]
["NDInsgesamtWeiblichInsgesamtDeutscheAkademische Ausbildung",31370,2446,"7,8",7.7972585272553392]
["NDInsgesamtWeiblichInsgesamtAusländerInsgesamt",150897,24925,"16,5",16.51788968634234]
["NDInsgesamtWeiblichInsgesamtAusländerKeine Berufsausbildung",118655,19737,"16,6",16.633938729931312]
["NDInsgesamtWeiblichInsgesamtAusländerBetriebliche/schulische Ausbildung",14834,2572,"17,3",17.338546582176082]
["NDInsgesamtWeiblichInsgesamtAusländerAkademische Ausbildung",17408,2616,"15,0",15.027573529411764]
["NDInsgesamtWeiblich15 bis unter 25 JahreInsgesamtInsgesamt",58448,3933,"6,7",6.7290583082398037]
["NDInsgesamtWeiblich15 bis unter 25 JahreInsgesamtKeine Berufsausbildung",41683,3353,"8,0",8.044046733680398]
["NDInsgesamtWeiblich15 bis unter 25 JahreInsgesamtBetriebliche/schulische Ausbildung",14922,503,"3,4",3.3708618147701381]
["NDInsgesamtWeiblich15 bis unter 25 JahreInsgesamtAkademische Ausbildung",1843,77,"4,2",4.1779706999457407]
["NDInsgesamtWeiblich15 bis unter 25 JahreDeutscheInsgesamt",38433,2521,"6,6",6.5594671246064582]
["NDInsgesamtWeiblich15 bis unter 25 JahreDeutscheKeine Berufsausbildung",23994,2105,"8,8",8.7730265899808284]
["NDInsgesamtWeiblich15 bis unter 25 JahreDeutscheBetriebliche/schulische Ausbildung",13306,391,"2,9",2.9385239741470013]
["NDInsgesamtWeiblich15 bis unter 25 JahreDeutscheAkademische Ausbildung",1133,25,"2,2",2.206531332744925]
["NDInsgesamtWeiblich15 bis unter 25 JahreAusländerInsgesamt",20015,1412,"7,1",7.0547089682737942]
["NDInsgesamtWeiblich15 bis unter 25 JahreAusländerKeine Berufsausbildung",17689,1248,"7,1",7.0552320651252192]
["NDInsgesamtWeiblich15 bis unter 25 JahreAusländerBetriebliche/schulische Ausbildung",1616,112,"6,9",6.9306930693069315]
["NDInsgesamtWeiblich15 bis unter 25 JahreAusländerAkademische Ausbildung",710,52,"7,3",7.323943661971831]
["NDInsgesamtWeiblich25 bis unter 35 JahreInsgesamtInsgesamt",98926,13519,"13,7",13.66577037381477]
["NDInsgesamtWeiblich25 bis unter 35 JahreInsgesamtKeine Berufsausbildung",51219,9164,"17,9",17.891797965598705]
["NDInsgesamtWeiblich25 bis unter 35 JahreInsgesamtBetriebliche/schulische Ausbildung",28665,3045,"10,6",10.622710622710622]
["NDInsgesamtWeiblich25 bis unter 35 JahreInsgesamtAkademische Ausbildung",19042,1310,"6,9",6.8795294611910514]
["NDInsgesamtWeiblich25 bis unter 35 JahreDeutscheInsgesamt",58741,7121,"12,1",12.122708159547846]
["NDInsgesamtWeiblich25 bis unter 35 JahreDeutscheKeine Berufsausbildung",21067,4183,"19,9",19.855698485783453]
["NDInsgesamtWeiblich25 bis unter 35 JahreDeutscheBetriebliche/schulische Ausbildung",24840,2414,"9,7",9.7181964573268935]
["NDInsgesamtWeiblich25 bis unter 35 JahreDeutscheAkademische Ausbildung",12834,524,"4,1",4.0829047841670558]
["NDInsgesamtWeiblich25 bis unter 35 JahreAusländerInsgesamt",40185,6398,"15,9",15.921363692920243]
["NDInsgesamtWeiblich25 bis unter 35 JahreAusländerKeine Berufsausbildung",30152,4981,"16,5",16.519633855133989]
["NDInsgesamtWeiblich25 bis unter 35 JahreAusländerBetriebliche/schulische Ausbildung",3825,631,"16,5",16.496732026143789]
["NDInsgesamtWeiblich25 bis unter 35 JahreAusländerAkademische Ausbildung",6208,786,"12,7",12.661082474226804]
["NDInsgesamtWeiblich35 bis unter 45 JahreInsgesamtInsgesamt",91896,14484,"15,8",15.761295377383128]
["NDInsgesamtWeiblich35 bis unter 45 JahreInsgesamtKeine Berufsausbildung",50868,9442,"18,6",18.561767712510814]
["NDInsgesamtWeiblich35 bis unter 45 JahreInsgesamtBetriebliche/schulische Ausbildung",25927,3328,"12,8",12.836039649785938]
["NDInsgesamtWeiblich35 bis unter 45 JahreInsgesamtAkademische Ausbildung",15101,1714,"11,4",11.350241705847294]
["NDInsgesamtWeiblich35 bis unter 45 JahreDeutscheInsgesamt",46510,6277,"13,5",13.496022360782629]
["NDInsgesamtWeiblich35 bis unter 45 JahreDeutscheKeine Berufsausbildung",16524,3112,"18,8",18.833212297264584]
["NDInsgesamtWeiblich35 bis unter 45 JahreDeutscheBetriebliche/schulische Ausbildung",21605,2516,"11,6",11.645452441564451]
["NDInsgesamtWeiblich35 bis unter 45 JahreDeutscheAkademische Ausbildung",8381,649,"7,7",7.7437060016704446]
["NDInsgesamtWeiblich35 bis unter 45 JahreAusländerInsgesamt",45386,8207,"18,1",18.082668664345832]
["NDInsgesamtWeiblich35 bis unter 45 JahreAusländerKeine Berufsausbildung",34344,6330,"18,4",18.431167016072678]
["NDInsgesamtWeiblich35 bis unter 45 JahreAusländerBetriebliche/schulische Ausbildung",4322,812,"18,8",18.78759833410458]
["NDInsgesamtWeiblich35 bis unter 45 JahreAusländerAkademische Ausbildung",6720,1065,"15,8",15.848214285714285]
["NDInsgesamtWeiblich45 bis unter 55 JahreInsgesamtInsgesamt",72646,10636,"14,6",14.640861162348925]
["NDInsgesamtWeiblich45 bis unter 55 JahreInsgesamtKeine Berufsausbildung",39445,6832,"17,3",17.320319432120673]
["NDInsgesamtWeiblich45 bis unter 55 JahreInsgesamtBetriebliche/schulische Ausbildung",25819,2940,"11,4",11.386963089197879]
["NDInsgesamtWeiblich45 bis unter 55 JahreInsgesamtAkademische Ausbildung",7382,864,"11,7",11.704145218098077]
["NDInsgesamtWeiblich45 bis unter 55 JahreDeutscheInsgesamt",43033,5186,"12,1",12.051216508261103]
["NDInsgesamtWeiblich45 bis unter 55 JahreDeutscheKeine Berufsausbildung",16035,2421,"15,1",15.098222637979418]
["NDInsgesamtWeiblich45 bis unter 55 JahreDeutscheBetriebliche/schulische Ausbildung",22292,2346,"10,5",10.523954781984568]
["NDInsgesamtWeiblich45 bis unter 55 JahreDeutscheAkademische Ausbildung",4706,419,"8,9",8.9035274118147036]
["NDInsgesamtWeiblich45 bis unter 55 JahreAusländerInsgesamt",29611,5450,"18,4",18.405322346425315]
["NDInsgesamtWeiblich45 bis unter 55 JahreAusländerKeine Berufsausbildung",23408,4411,"18,8",18.843984962406015]
["NDInsgesamtWeiblich45 bis unter 55 JahreAusländerBetriebliche/schulische Ausbildung",3527,594,"16,8",16.841508364048767]
["NDInsgesamtWeiblich45 bis unter 55 JahreAusländerAkademische Ausbildung",2676,445,"16,6",16.62929745889387]
["NDInsgesamtWeiblich55 und älterInsgesamtInsgesamt",61225,12935,"21,1",21.126990608411596]
["NDInsgesamtWeiblich55 und älterInsgesamtKeine Berufsausbildung",29993,6240,"20,8",20.804854466042077]
["NDInsgesamtWeiblich55 und älterInsgesamtBetriebliche/schulische Ausbildung",25822,5598,"21,7",21.679188289055844]
["NDInsgesamtWeiblich55 und älterInsgesamtAkademische Ausbildung",5410,1097,"20,3",20.277264325323475]
["NDInsgesamtWeiblich55 und älterDeutscheInsgesamt",45525,9477,"20,8",20.817133443163097]
["NDInsgesamtWeiblich55 und älterDeutscheKeine Berufsausbildung",16931,3473,"20,5",20.512669068572443]
["NDInsgesamtWeiblich55 und älterDeutscheBetriebliche/schulische Ausbildung",24278,5175,"21,3",21.315594365268968]
["NDInsgesamtWeiblich55 und älterDeutscheAkademische Ausbildung",4316,829,"19,2",19.207599629286378]
["NDInsgesamtWeiblich55 und älterAusländerInsgesamt",15700,3458,"22,0",22.02547770700637]
["NDInsgesamtWeiblich55 und älterAusländerKeine Berufsausbildung",13062,2767,"21,2",21.183585974582758]
["NDInsgesamtWeiblich55 und älterAusländerBetriebliche/schulische Ausbildung",1544,423,"27,4",27.396373056994815]
["NDInsgesamtWeiblich55 und älterAusländerAkademische Ausbildung",1094,268,"24,5",24.497257769652649]
["NDIIIInsgesamtInsgesamtInsgesamtInsgesamt",391977,38145,"9,7",9.7314383241873887]
["NDIIIInsgesamtInsgesamtInsgesamtKeine Berufsausbildung",142730,14423,"10,1",10.105093533244586]
["NDIIIInsgesamtInsgesamtInsgesamtBetriebliche/schulische Ausbildung",187271,18570,"9,9",9.916110876750805]
["NDIIIInsgesamtInsgesamtInsgesamtAkademische Ausbildung",61976,5152,"8,3",8.3128953143152184]
["NDIIIInsgesamtInsgesamtDeutscheInsgesamt",310377,30799,"9,9",9.9230935281931334]
["NDIIIInsgesamtInsgesamtDeutscheKeine Berufsausbildung",89506,9373,"10,5",10.471923669921569]
["NDIIIInsgesamtInsgesamtDeutscheBetriebliche/schulische Ausbildung",171101,17204,"10,1",10.054879866277812]
["NDIIIInsgesamtInsgesamtDeutscheAkademische Ausbildung",49770,4222,"8,5",8.4830219007434184]
["NDIIIInsgesamtInsgesamtAusländerInsgesamt",81600,7346,"9,0",9.0024509803921564]
["NDIIIInsgesamtInsgesamtAusländerKeine Berufsausbildung",53224,5050,"9,5",9.4882008116639103]
["NDIIIInsgesamtInsgesamtAusländerBetriebliche/schulische Ausbildung",16170,1366,"8,4",8.4477427334570176]
["NDIIIInsgesamtInsgesamtAusländerAkademische Ausbildung",12206,930,"7,6",7.619203670326069]
["NDIIIInsgesamt15 bis unter 25 JahreInsgesamtInsgesamt",67061,2211,"3,3",3.2969982553197839]
["NDIIIInsgesamt15 bis unter 25 JahreInsgesamtKeine Berufsausbildung",34212,1308,"3,8",3.8232199228340931]
["NDIIIInsgesamt15 bis unter 25 JahreInsgesamtBetriebliche/schulische Ausbildung",31211,878,"2,8",2.8131107622312643]
["NDIIIInsgesamt15 bis unter 25 JahreInsgesamtAkademische Ausbildung",1638,25,"1,5",1.5262515262515262]
["NDIIIInsgesamt15 bis unter 25 JahreDeutscheInsgesamt",56062,1734,"3,1",3.0930041739502694]
["NDIIIInsgesamt15 bis unter 25 JahreDeutscheKeine Berufsausbildung",25883,940,"3,6",3.6317273886334664]
["NDIIIInsgesamt15 bis unter 25 JahreDeutscheBetriebliche/schulische Ausbildung",28711,774,"2,7",2.6958308662185222]
["NDIIIInsgesamt15 bis unter 25 JahreDeutscheAkademische Ausbildung",1468,20,"1,4",1.3623978201634876]
["NDIIIInsgesamt15 bis unter 25 JahreAusländerInsgesamt",10999,477,"4,3",4.336757887080644]
["NDIIIInsgesamt15 bis unter 25 JahreAusländerKeine Berufsausbildung",8329,368,"4,4",4.418297514707648]
["NDIIIInsgesamt15 bis unter 25 JahreAusländerBetriebliche/schulische Ausbildung",2500,104,"4,2",4.16]
["NDIIIInsgesamt15 bis unter 25 JahreAusländerAkademische Ausbildung",170,5,"2,9",2.9411764705882351]
["NDIIIInsgesamt25 bis unter 35 JahreInsgesamtInsgesamt",110145,7628,"6,9",6.9254164964365152]
["NDIIIInsgesamt25 bis unter 35 JahreInsgesamtKeine Berufsausbildung",37347,3499,"9,4",9.368891744986211]
["NDIIIInsgesamt25 bis unter 35 JahreInsgesamtBetriebliche/schulische Ausbildung",48912,3078,"6,3",6.2929342492639844]
["NDIIIInsgesamt25 bis unter 35 JahreInsgesamtAkademische Ausbildung",23886,1051,"4,4",4.4000669848446794]
["NDIIIInsgesamt25 bis unter 35 JahreDeutscheInsgesamt",81889,5265,"6,4",6.4294349668453643]
["NDIIIInsgesamt25 bis unter 35 JahreDeutscheKeine Berufsausbildung",19669,1886,"9,6",9.5886928669479907]
["NDIIIInsgesamt25 bis unter 35 JahreDeutscheBetriebliche/schulische Ausbildung",43578,2687,"6,2",6.1659552985451374]
["NDIIIInsgesamt25 bis unter 35 JahreDeutscheAkademische Ausbildung",18642,692,"3,7",3.7120480635124986]
["NDIIIInsgesamt25 bis unter 35 JahreAusländerInsgesamt",28256,2363,"8,4",8.3628255945639864]
["NDIIIInsgesamt25 bis unter 35 JahreAusländerKeine Berufsausbildung",17678,1613,"9,1",9.1243353320511371]
["NDIIIInsgesamt25 bis unter 35 JahreAusländerBetriebliche/schulische Ausbildung",5334,391,"7,3",7.3303337082864646]
["NDIIIInsgesamt25 bis unter 35 JahreAusländerAkademische Ausbildung",5244,359,"6,8",6.8459191456903126]
["NDIIIInsgesamt35 bis unter 45 JahreInsgesamtInsgesamt",79883,6596,"8,3",8.257075973611407]
["NDIIIInsgesamt35 bis unter 45 JahreInsgesamtKeine Berufsausbildung",27494,2778,"10,1",10.104022695860914]
["NDIIIInsgesamt35 bis unter 45 JahreInsgesamtBetriebliche/schulische Ausbildung",34848,2624,"7,5",7.5298438934802574]
["NDIIIInsgesamt35 bis unter 45 JahreInsgesamtAkademische Ausbildung",17541,1194,"6,8",6.8069095262527783]
["NDIIIInsgesamt35 bis unter 45 JahreDeutscheInsgesamt",58453,4611,"7,9",7.8883889620720922]
["NDIIIInsgesamt35 bis unter 45 JahreDeutscheKeine Berufsausbildung",14458,1450,"10,0",10.029049661087287]
["NDIIIInsgesamt35 bis unter 45 JahreDeutscheBetriebliche/schulische Ausbildung",31108,2293,"7,4",7.3710942522823713]
["NDIIIInsgesamt35 bis unter 45 JahreDeutscheAkademische Ausbildung",12887,868,"6,7",6.7354698533405752]
["NDIIIInsgesamt35 bis unter 45 JahreAusländerInsgesamt",21430,1985,"9,3",9.262715818945404]
["NDIIIInsgesamt35 bis unter 45 JahreAusländerKeine Berufsausbildung",13036,1328,"10,2",10.187173979748389]
["NDIIIInsgesamt35 bis unter 45 JahreAusländerBetriebliche/schulische Ausbildung",3740,331,"8,9",8.8502673796791438]
["NDIIIInsgesamt35 bis unter 45 JahreAusländerAkademische Ausbildung",4654,326,"7,0",7.0047271164589597]
["NDIIIInsgesamt45 bis unter 55 JahreInsgesamtInsgesamt",66299,5873,"8,9",8.8583538213246058]
["NDIIIInsgesamt45 bis unter 55 JahreInsgesamtKeine Berufsausbildung",22726,2262,"10,0",9.9533573880137283]
["NDIIIInsgesamt45 bis unter 55 JahreInsgesamtBetriebliche/schulische Ausbildung",34236,2835,"8,3",8.2807570977917972]
["NDIIIInsgesamt45 bis unter 55 JahreInsgesamtAkademische Ausbildung",9337,776,"8,3",8.311020670450894]
["NDIIIInsgesamt45 bis unter 55 JahreDeutscheInsgesamt",52190,4527,"8,7",8.6740754933895374]
["NDIIIInsgesamt45 bis unter 55 JahreDeutscheKeine Berufsausbildung",13277,1341,"10,1",10.100173231904797]
["NDIIIInsgesamt45 bis unter 55 JahreDeutscheBetriebliche/schulische Ausbildung",31116,2551,"8,2",8.1983545442858983]
["NDIIIInsgesamt45 bis unter 55 JahreDeutscheAkademische Ausbildung",7797,635,"8,1",8.1441580094908304]
["NDIIIInsgesamt45 bis unter 55 JahreAusländerInsgesamt",14109,1346,"9,5",9.5400099227443462]
["NDIIIInsgesamt45 bis unter 55 JahreAusländerKeine Berufsausbildung",9449,921,"9,7",9.7470631812890254]
["NDIIIInsgesamt45 bis unter 55 JahreAusländerBetriebliche/schulische Ausbildung",3120,284,"9,1",9.1025641025641022]
["NDIIIInsgesamt45 bis unter 55 JahreAusländerAkademische Ausbildung",1540,141,"9,2",9.1558441558441555]
["NDIIIInsgesamt55 und älterInsgesamtInsgesamt",68589,15837,"23,1",23.089708262257798]
["NDIIIInsgesamt55 und älterInsgesamtKeine Berufsausbildung",20951,4576,"21,8",21.841439549424848]
["NDIIIInsgesamt55 und älterInsgesamtBetriebliche/schulische Ausbildung",38064,9155,"24,1",24.051597309794033]
["NDIIIInsgesamt55 und älterInsgesamtAkademische Ausbildung",9574,2106,"22,0",21.997075412575725]
["NDIIIInsgesamt55 und älterDeutscheInsgesamt",61783,14662,"23,7",23.731447161840634]
["NDIIIInsgesamt55 und älterDeutscheKeine Berufsausbildung",16219,3756,"23,2",23.158024539120785]
["NDIIIInsgesamt55 und älterDeutscheBetriebliche/schulische Ausbildung",36588,8899,"24,3",24.322182136219524]
["NDIIIInsgesamt55 und älterDeutscheAkademische Ausbildung",8976,2007,"22,4",22.359625668449198]
["NDIIIInsgesamt55 und älterAusländerInsgesamt",6806,1175,"17,3",17.264178665883044]
["NDIIIInsgesamt55 und älterAusländerKeine Berufsausbildung",4732,820,"17,3",17.328825021132712]
["NDIIIInsgesamt55 und älterAusländerBetriebliche/schulische Ausbildung",1476,256,"17,3",17.344173441734416]
["NDIIIInsgesamt55 und älterAusländerAkademische Ausbildung",598,99,"16,6",16.555183946488295]
["NDIIIMännlichInsgesamtInsgesamtInsgesamt",220330,22403,"10,2",10.167929923296873]
["NDIIIMännlichInsgesamtInsgesamtKeine Berufsausbildung",90455,9117,"10,1",10.079044828920459]
["NDIIIMännlichInsgesamtInsgesamtBetriebliche/schulische Ausbildung",101912,10463,"10,3",10.266700682942147]
["NDIIIMännlichInsgesamtInsgesamtAkademische Ausbildung",27963,2823,"10,1",10.095483317240639]
["NDIIIMännlichInsgesamtDeutscheInsgesamt",168707,17808,"10,6",10.555578606696818]
["NDIIIMännlichInsgesamtDeutscheKeine Berufsausbildung",53889,5754,"10,7",10.67750375772421]
["NDIIIMännlichInsgesamtDeutscheBetriebliche/schulische Ausbildung",92164,9633,"10,5",10.452020311618419]
["NDIIIMännlichInsgesamtDeutscheAkademische Ausbildung",22654,2421,"10,7",10.686854418645714]
["NDIIIMännlichInsgesamtAusländerInsgesamt",51623,4595,"8,9",8.9010712279410331]
["NDIIIMännlichInsgesamtAusländerKeine Berufsausbildung",36566,3363,"9,2",9.1970683148279821]
["NDIIIMännlichInsgesamtAusländerBetriebliche/schulische Ausbildung",9748,830,"8,5",8.5145670906852686]
["NDIIIMännlichInsgesamtAusländerAkademische Ausbildung",5309,402,"7,6",7.5720474665662074]
["NDIIIMännlich15 bis unter 25 JahreInsgesamtInsgesamt",41398,1484,"3,6",3.584714237402773]
["NDIIIMännlich15 bis unter 25 JahreInsgesamtKeine Berufsausbildung",22493,916,"4,1",4.0723780731783217]
["NDIIIMännlich15 bis unter 25 JahreInsgesamtBetriebliche/schulische Ausbildung",18332,562,"3,1",3.0656775038184594]
["NDIIIMännlich15 bis unter 25 JahreInsgesamtAkademische Ausbildung",573,6,"1,0",1.0471204188481675]
["NDIIIMännlich15 bis unter 25 JahreDeutscheInsgesamt",33656,1136,"3,4",3.375326836225339]
["NDIIIMännlich15 bis unter 25 JahreDeutscheKeine Berufsausbildung",16374,631,"3,9",3.8536704531574451]
["NDIIIMännlich15 bis unter 25 JahreDeutscheBetriebliche/schulische Ausbildung",16766,501,"3,0",2.9881903853035907]
["NDIIIMännlich15 bis unter 25 JahreDeutscheAkademische Ausbildung",516,4,"0,8",0.77519379844961245]
["NDIIIMännlich15 bis unter 25 JahreAusländerInsgesamt",7742,348,"4,5",4.4949625419788166]
["NDIIIMännlich15 bis unter 25 JahreAusländerKeine Berufsausbildung",6119,285,"4,7",4.6576237947377024]
["NDIIIMännlich15 bis unter 25 JahreAusländerBetriebliche/schulische Ausbildung",1566,61,"3,9",3.8952745849297572]
["NDIIIMännlich15 bis unter 25 JahreAusländerAkademische Ausbildung","*","*","k.A.",{"$error":"#N/A"}]
["NDIIIMännlich25 bis unter 35 JahreInsgesamtInsgesamt",64221,4724,"7,4",7.3558493327727694]
["NDIIIMännlich25 bis unter 35 JahreInsgesamtKeine Berufsausbildung",26115,2497,"9,6",9.5615546620716056]
["NDIIIMännlich25 bis unter 35 JahreInsgesamtBetriebliche/schulische Ausbildung",28215,1737,"6,2",6.1562998405103668]
["NDIIIMännlich25 bis unter 35 JahreInsgesamtAkademische Ausbildung",9891,490,"5,0",4.9539985845718331]
["NDIIIMännlich25 bis unter 35 JahreDeutscheInsgesamt",45537,3147,"6,9",6.9108636932604259]
["NDIIIMännlich25 bis unter 35 JahreDeutscheKeine Berufsausbildung",13019,1297,"10,0",9.9623627006682529]
["NDIIIMännlich25 bis unter 35 JahreDeutscheBetriebliche/schulische Ausbildung",24890,1508,"6,1",6.0586580956207312]
["NDIIIMännlich25 bis unter 35 JahreDeutscheAkademische Ausbildung",7628,342,"4,5",4.4834819087572102]
["NDIIIMännlich25 bis unter 35 JahreAusländerInsgesamt",18684,1577,"8,4",8.4403767929779487]
["NDIIIMännlich25 bis unter 35 JahreAusländerKeine Berufsausbildung",13096,1200,"9,2",9.1631032376298105]
["NDIIIMännlich25 bis unter 35 JahreAusländerBetriebliche/schulische Ausbildung",3325,229,"6,9",6.8872180451127818]
["NDIIIMännlich25 bis unter 35 JahreAusländerAkademische Ausbildung",2263,148,"6,5",6.5399911621741049]
["NDIIIMännlich35 bis unter 45 JahreInsgesamtInsgesamt",43870,3884,"8,9",8.85343059038067]
["NDIIIMännlich35 bis unter 45 JahreInsgesamtKeine Berufsausbildung",17622,1836,"10,4",10.418794688457609]
["NDIIIMännlich35 bis unter 45 JahreInsgesamtBetriebliche/schulische Ausbildung",18712,1516,"8,1",8.1017528858486543]
["NDIIIMännlich35 bis unter 45 JahreInsgesamtAkademische Ausbildung",7536,532,"7,1",7.059447983014862]
["NDIIIMännlich35 bis unter 45 JahreDeutscheInsgesamt",30878,2687,"8,7",8.7019884707558788]
["NDIIIMännlich35 bis unter 45 JahreDeutscheKeine Berufsausbildung",8827,978,"11,1",11.079642007477059]
["NDIIIMännlich35 bis unter 45 JahreDeutscheBetriebliche/schulische Ausbildung",16543,1313,"7,9",7.9368917366862117]
["NDIIIMännlich35 bis unter 45 JahreDeutscheAkademische Ausbildung",5508,396,"7,2",7.18954248366013]
["NDIIIMännlich35 bis unter 45 JahreAusländerInsgesamt",12992,1197,"9,2",9.213362068965516]
["NDIIIMännlich35 bis unter 45 JahreAusländerKeine Berufsausbildung",8795,858,"9,8",9.755542922114838]
["NDIIIMännlich35 bis unter 45 JahreAusländerBetriebliche/schulische Ausbildung",2169,203,"9,4",9.3591516828031356]
["NDIIIMännlich35 bis unter 45 JahreAusländerAkademische Ausbildung",2028,136,"6,7",6.7061143984220903]
["NDIIIMännlich45 bis unter 55 JahreInsgesamtInsgesamt",34243,3293,"9,6",9.616563969278392]
["NDIIIMännlich45 bis unter 55 JahreInsgesamtKeine Berufsausbildung",12718,1341,"10,5",10.544110709231012]
["NDIIIMännlich45 bis unter 55 JahreInsgesamtBetriebliche/schulische Ausbildung",17112,1552,"9,1",9.0696587190275828]
["NDIIIMännlich45 bis unter 55 JahreInsgesamtAkademische Ausbildung",4413,400,"9,1",9.0641287106276902]
["NDIIIMännlich45 bis unter 55 JahreDeutscheInsgesamt",26238,2520,"9,6",9.6043905785501948]
["NDIIIMännlich45 bis unter 55 JahreDeutscheKeine Berufsausbildung",7105,797,"11,2",11.217452498240675]
["NDIIIMännlich45 bis unter 55 JahreDeutscheBetriebliche/schulische Ausbildung",15364,1379,"9,0",8.9755272064566523]
["NDIIIMännlich45 bis unter 55 JahreDeutscheAkademische Ausbildung",3769,344,"9,1",9.1270894136375702]
["NDIIIMännlich45 bis unter 55 JahreAusländerInsgesamt",8005,773,"9,7",9.656464709556527]
["NDIIIMännlich45 bis unter 55 JahreAusländerKeine Berufsausbildung",5613,544,"9,7",9.691786923213968]
["NDIIIMännlich45 bis unter 55 JahreAusländerBetriebliche/schulische Ausbildung",1748,173,"9,9",9.8970251716247137]
["NDIIIMännlich45 bis unter 55 JahreAusländerAkademische Ausbildung",644,56,"8,7",8.695652173913043]
["NDIIIMännlich55 und älterInsgesamtInsgesamt",36598,9018,"24,6",24.640690748128314]
["NDIIIMännlich55 und älterInsgesamtKeine Berufsausbildung",11507,2527,"22,0",21.960545754757973]
["NDIIIMännlich55 und älterInsgesamtBetriebliche/schulische Ausbildung",19541,5096,"26,1",26.078501611995293]
["NDIIIMännlich55 und älterInsgesamtAkademische Ausbildung",5550,1395,"25,1",25.135135135135133]
["NDIIIMännlich55 und älterDeutscheInsgesamt",32398,8318,"25,7",25.674424347181922]
["NDIIIMännlich55 und älterDeutscheKeine Berufsausbildung",8564,2051,"23,9",23.94908921064923]
["NDIIIMännlich55 und älterDeutscheBetriebliche/schulische Ausbildung",18601,4932,"26,5",26.514703510563947]
["NDIIIMännlich55 und älterDeutscheAkademische Ausbildung",5233,1335,"25,5",25.51117905599083]
["NDIIIMännlich55 und älterAusländerInsgesamt",4200,700,"16,7",16.666666666666664]
["NDIIIMännlich55 und älterAusländerKeine Berufsausbildung",2943,476,"16,2",16.173972137274887]
["NDIIIMännlich55 und älterAusländerBetriebliche/schulische Ausbildung",940,164,"17,4",17.446808510638299]
["NDIIIMännlich55 und älterAusländerAkademische Ausbildung",317,60,"18,9",18.927444794952681]
["NDIIIWeiblichInsgesamtInsgesamtInsgesamt",171641,15742,"9,2",9.1714683554628564]
["NDIIIWeiblichInsgesamtInsgesamtKeine Berufsausbildung",52272,5306,"10,2",10.150749923477196]
["NDIIIWeiblichInsgesamtInsgesamtBetriebliche/schulische Ausbildung",85357,8107,"9,5",9.4977564816008062]
["NDIIIWeiblichInsgesamtInsgesamtAkademische Ausbildung",34012,2329,"6,8",6.8475832059273198]
["NDIIIWeiblichInsgesamtDeutscheInsgesamt",141665,12991,"9,2",9.1702255320650838]
["NDIIIWeiblichInsgesamtDeutscheKeine Berufsausbildung",35614,3619,"10,2",10.161734149491773]
["NDIIIWeiblichInsgesamtDeutscheBetriebliche/schulische Ausbildung",78936,7571,"9,6",9.5913144826188308]
["NDIIIWeiblichInsgesamtDeutscheAkademische Ausbildung",27115,1801,"6,6",6.6420800295039646]
["NDIIIWeiblichInsgesamtAusländerInsgesamt",29976,2751,"9,2",9.1773418734987988]
["NDIIIWeiblichInsgesamtAusländerKeine Berufsausbildung",16658,1687,"10,1",10.127266178412775]
["NDIIIWeiblichInsgesamtAusländerBetriebliche/schulische Ausbildung",6421,536,"8,3",8.347609406634481]
["NDIIIWeiblichInsgesamtAusländerAkademische Ausbildung",6897,528,"7,7",7.6555023923444976]
["NDIIIWeiblich15 bis unter 25 JahreInsgesamtInsgesamt",25659,727,"2,8",2.8333138469932577]
["NDIIIWeiblich15 bis unter 25 JahreInsgesamtKeine Berufsausbildung",11717,392,"3,3",3.3455662712298371]
["NDIIIWeiblich15 bis unter 25 JahreInsgesamtBetriebliche/schulische Ausbildung",12878,316,"2,5",2.4537971734741419]
["NDIIIWeiblich15 bis unter 25 JahreInsgesamtAkademische Ausbildung",1064,19,"1,8",1.7857142857142856]
["NDIIIWeiblich15 bis unter 25 JahreDeutscheInsgesamt",22403,598,"2,7",2.6692853635673792]
["NDIIIWeiblich15 bis unter 25 JahreDeutscheKeine Berufsausbildung",9507,309,"3,3",3.2502366677185228]
["NDIIIWeiblich15 bis unter 25 JahreDeutscheBetriebliche/schulische Ausbildung",11945,273,"2,3",2.2854750941816659]
["NDIIIWeiblich15 bis unter 25 JahreDeutscheAkademische Ausbildung",951,16,"1,7",1.6824395373291272]
["NDIIIWeiblich15 bis unter 25 JahreAusländerInsgesamt",3256,129,"4,0",3.961916461916462]
["NDIIIWeiblich15 bis unter 25 JahreAusländerKeine Berufsausbildung",2210,83,"3,8",3.755656108597285]
["NDIIIWeiblich15 bis unter 25 JahreAusländerBetriebliche/schulische Ausbildung",933,43,"4,6",4.6087888531618439]
["NDIIIWeiblich15 bis unter 25 JahreAusländerAkademische Ausbildung","*","*","2,7",2.6548672566371683]
["NDIIIWeiblich25 bis unter 35 JahreInsgesamtInsgesamt",45922,2904,"6,3",6.3237663864814246]
["NDIIIWeiblich25 bis unter 35 JahreInsgesamtKeine Berufsausbildung",11231,1002,"8,9",8.9217344849078444]
["NDIIIWeiblich25 bis unter 35 JahreInsgesamtBetriebliche/schulische Ausbildung",20696,1341,"6,5",6.4795129493621957]
["NDIIIWeiblich25 bis unter 35 JahreInsgesamtAkademische Ausbildung",13995,561,"4,0",4.008574490889603]
["NDIIIWeiblich25 bis unter 35 JahreDeutscheInsgesamt",36350,2118,"5,8",5.8266850068775788]
["NDIIIWeiblich25 bis unter 35 JahreDeutscheKeine Berufsausbildung",6649,589,"8,9",8.8584749586403966]
["NDIIIWeiblich25 bis unter 35 JahreDeutscheBetriebliche/schulische Ausbildung",18687,1179,"6,3",6.3091989083319948]
["NDIIIWeiblich25 bis unter 35 JahreDeutscheAkademische Ausbildung",11014,350,"3,2",3.1777737425095336]
["NDIIIWeiblich25 bis unter 35 JahreAusländerInsgesamt",9572,786,"8,2",8.2114500626828253]
["NDIIIWeiblich25 bis unter 35 JahreAusländerKeine Berufsausbildung",4582,413,"9,0",9.0135312090790052]
["NDIIIWeiblich25 bis unter 35 JahreAusländerBetriebliche/schulische Ausbildung",2009,162,"8,1",8.0637132901941264]
["NDIIIWeiblich25 bis unter 35 JahreAusländerAkademische Ausbildung",2981,211,"7,1",7.0781616907078169]
["NDIIIWeiblich35 bis unter 45 JahreInsgesamtInsgesamt",36013,2712,"7,5",7.5306139449643181]
["NDIIIWeiblich35 bis unter 45 JahreInsgesamtKeine Berufsausbildung",9872,942,"9,5",9.5421393841166928]
["NDIIIWeiblich35 bis unter 45 JahreInsgesamtBetriebliche/schulische Ausbildung",16136,1108,"6,9",6.8666336142786317]
["NDIIIWeiblich35 bis unter 45 JahreInsgesamtAkademische Ausbildung",10005,662,"6,6",6.6166916541729144]
["NDIIIWeiblich35 bis unter 45 JahreDeutscheInsgesamt",27575,1924,"7,0",6.9773345421577506]
["NDIIIWeiblich35 bis unter 45 JahreDeutscheKeine Berufsausbildung",5631,472,"8,4",8.3821701296394959]
["NDIIIWeiblich35 bis unter 45 JahreDeutscheBetriebliche/schulische Ausbildung",14565,980,"6,7",6.7284586337109511]
["NDIIIWeiblich35 bis unter 45 JahreDeutscheAkademische Ausbildung",7379,472,"6,4",6.3965306952161542]
["NDIIIWeiblich35 bis unter 45 JahreAusländerInsgesamt",8438,788,"9,3",9.338705854467884]
["NDIIIWeiblich35 bis unter 45 JahreAusländerKeine Berufsausbildung",4241,470,"11,1",11.082291912284839]
["NDIIIWeiblich35 bis unter 45 JahreAusländerBetriebliche/schulische Ausbildung",1571,128,"8,1",8.1476766390833859]
["NDIIIWeiblich35 bis unter 45 JahreAusländerAkademische Ausbildung",2626,190,"7,2",7.2353389185072352]
["NDIIIWeiblich45 bis unter 55 JahreInsgesamtInsgesamt",32056,2580,"8,0",8.0484152732717753]
["NDIIIWeiblich45 bis unter 55 JahreInsgesamtKeine Berufsausbildung",10008,921,"9,2",9.2026378896882495]
["NDIIIWeiblich45 bis unter 55 JahreInsgesamtBetriebliche/schulische Ausbildung",17124,1283,"7,5",7.4924083158140631]
["NDIIIWeiblich45 bis unter 55 JahreInsgesamtAkademische Ausbildung",4924,376,"7,6",7.6360682372055235]
["NDIIIWeiblich45 bis unter 55 JahreDeutscheInsgesamt",25952,2007,"7,7",7.7335080147965476]
["NDIIIWeiblich45 bis unter 55 JahreDeutscheKeine Berufsausbildung",6172,544,"8,8",8.8139987038237191]
["NDIIIWeiblich45 bis unter 55 JahreDeutscheBetriebliche/schulische Ausbildung",15752,1172,"7,4",7.4403250380904007]
["NDIIIWeiblich45 bis unter 55 JahreDeutscheAkademische Ausbildung",4028,291,"7,2",7.2244289970208539]
["NDIIIWeiblich45 bis unter 55 JahreAusländerInsgesamt",6104,573,"9,4",9.3872870249017044]
["NDIIIWeiblich45 bis unter 55 JahreAusländerKeine Berufsausbildung",3836,377,"9,8",9.8279457768508873]
["NDIIIWeiblich45 bis unter 55 JahreAusländerBetriebliche/schulische Ausbildung",1372,111,"8,1",8.0903790087463552]
["NDIIIWeiblich45 bis unter 55 JahreAusländerAkademische Ausbildung",896,85,"9,5",9.4866071428571423]
["NDIIIWeiblich55 und älterInsgesamtInsgesamt",31991,6819,"21,3",21.315369947797819]
["NDIIIWeiblich55 und älterInsgesamtKeine Berufsausbildung",9444,2049,"21,7",21.696315120711564]
["NDIIIWeiblich55 und älterInsgesamtBetriebliche/schulische Ausbildung",18523,4059,"21,9",21.913296982130326]
["NDIIIWeiblich55 und älterInsgesamtAkademische Ausbildung",4024,711,"17,7",17.668986083499007]
["NDIIIWeiblich55 und älterDeutscheInsgesamt",29385,6344,"21,6",21.589246214054789]
["NDIIIWeiblich55 und älterDeutscheKeine Berufsausbildung",7655,1705,"22,3",22.273024167210973]
["NDIIIWeiblich55 und älterDeutscheBetriebliche/schulische Ausbildung",17987,3967,"22,1",22.054817368099183]
["NDIIIWeiblich55 und älterDeutscheAkademische Ausbildung",3743,672,"18,0",17.95351322468608]
["NDIIIWeiblich55 und älterAusländerInsgesamt",2606,475,"18,2",18.227168073676133]
["NDIIIWeiblich55 und älterAusländerKeine Berufsausbildung",1789,344,"19,2",19.228619340413637]
["NDIIIWeiblich55 und älterAusländerBetriebliche/schulische Ausbildung",536,92,"17,2",17.164179104477611]
["NDIIIWeiblich55 und älterAusländerAkademische Ausbildung",281,39,"13,9",13.87900355871886]
["NDIIInsgesamtInsgesamtInsgesamtInsgesamt",408711,79262,"19,4",19.39316534176961]
["NDIIInsgesamtInsgesamtInsgesamtKeine Berufsausbildung",308407,58469,"19,0",18.958389401018781]
["NDIIInsgesamtInsgesamtInsgesamtBetriebliche/schulische Ausbildung",75419,16263,"21,6",21.563531736034687]
["NDIIInsgesamtInsgesamtInsgesamtAkademische Ausbildung",24885,4530,"18,2",18.203737191078964]
["NDIIInsgesamtInsgesamtDeutscheInsgesamt",192081,39573,"20,6",20.602245927499336]
["NDIIInsgesamtInsgesamtDeutscheKeine Berufsausbildung",123544,25482,"20,6",20.625849899630904]
["NDIIInsgesamtInsgesamtDeutscheBetriebliche/schulische Ausbildung",60265,12721,"21,1",21.108437733344395]
["NDIIInsgesamtInsgesamtDeutscheAkademische Ausbildung",8272,1370,"16,6",16.561895551257251]
["NDIIInsgesamtInsgesamtAusländerInsgesamt",216624,39689,"18,3",18.321607947411184]
["NDIIInsgesamtInsgesamtAusländerKeine Berufsausbildung",184858,32987,"17,8",17.844507676162245]
["NDIIInsgesamtInsgesamtAusländerBetriebliche/schulische Ausbildung",15153,3542,"23,4",23.374909258892629]
["NDIIInsgesamtInsgesamtAusländerAkademische Ausbildung",16613,3160,"19,0",19.021248419912119]
["NDIIInsgesamt15 bis unter 25 JahreInsgesamtInsgesamt",70206,7316,"10,4",10.420761758254281]
["NDIIInsgesamt15 bis unter 25 JahreInsgesamtKeine Berufsausbildung",65283,6866,"10,5",10.517286276672335]
["NDIIInsgesamt15 bis unter 25 JahreInsgesamtBetriebliche/schulische Ausbildung",3825,372,"9,7",9.7254901960784323]
["NDIIInsgesamt15 bis unter 25 JahreInsgesamtAkademische Ausbildung",1098,78,"7,1",7.1038251366120218]
["NDIIInsgesamt15 bis unter 25 JahreDeutscheInsgesamt",34165,4248,"12,4",12.433777257427192]
["NDIIInsgesamt15 bis unter 25 JahreDeutscheKeine Berufsausbildung",31312,3982,"12,7",12.717169136433315]
["NDIIInsgesamt15 bis unter 25 JahreDeutscheBetriebliche/schulische Ausbildung",2582,253,"9,8",9.7986057319907047]
["NDIIInsgesamt15 bis unter 25 JahreDeutscheAkademische Ausbildung",271,13,"4,8",4.7970479704797047]
["NDIIInsgesamt15 bis unter 25 JahreAusländerInsgesamt",36040,3068,"8,5",8.5127635960044401]
["NDIIInsgesamt15 bis unter 25 JahreAusländerKeine Berufsausbildung",33970,2884,"8,5",8.4898439799823375]
["NDIIInsgesamt15 bis unter 25 JahreAusländerBetriebliche/schulische Ausbildung",1243,119,"9,6",9.5736122284794849]
["NDIIInsgesamt15 bis unter 25 JahreAusländerAkademische Ausbildung",827,65,"7,9",7.8597339782345825]
["NDIIInsgesamt25 bis unter 35 JahreInsgesamtInsgesamt",105422,21186,"20,1",20.096374570772703]
["NDIIInsgesamt25 bis unter 35 JahreInsgesamtKeine Berufsausbildung",80018,16478,"20,6",20.592866605013871]
["NDIIInsgesamt25 bis unter 35 JahreInsgesamtBetriebliche/schulische Ausbildung",16742,3517,"21,0",21.007048142396368]
["NDIIInsgesamt25 bis unter 35 JahreInsgesamtAkademische Ausbildung",8662,1191,"13,7",13.749711383052412]
["NDIIInsgesamt25 bis unter 35 JahreDeutscheInsgesamt",48005,10789,"22,5",22.474742214352673]
["NDIIInsgesamt25 bis unter 35 JahreDeutscheKeine Berufsausbildung",31543,7762,"24,6",24.607678407253591]
["NDIIInsgesamt25 bis unter 35 JahreDeutscheBetriebliche/schulische Ausbildung",13112,2693,"20,5",20.53843807199512]
["NDIIInsgesamt25 bis unter 35 JahreDeutscheAkademische Ausbildung",3350,334,"10,0",9.9701492537313428]
["NDIIInsgesamt25 bis unter 35 JahreAusländerInsgesamt",57416,10397,"18,1",18.108192838233244]
["NDIIInsgesamt25 bis unter 35 JahreAusländerKeine Berufsausbildung",48474,8716,"18,0",17.980773198003053]
["NDIIInsgesamt25 bis unter 35 JahreAusländerBetriebliche/schulische Ausbildung",3630,824,"22,7",22.699724517906336]
["NDIIInsgesamt25 bis unter 35 JahreAusländerAkademische Ausbildung",5312,857,"16,1",16.133283132530121]
["NDIIInsgesamt35 bis unter 45 JahreInsgesamtInsgesamt",101323,22052,"21,8",21.76406146679431]
["NDIIInsgesamt35 bis unter 45 JahreInsgesamtKeine Berufsausbildung",73379,15875,"21,6",21.634255032093648]
["NDIIInsgesamt35 bis unter 45 JahreInsgesamtBetriebliche/schulische Ausbildung",19683,4527,"23,0",22.999542752629175]
["NDIIInsgesamt35 bis unter 45 JahreInsgesamtAkademische Ausbildung",8261,1650,"20,0",19.973368841544605]
["NDIIInsgesamt35 bis unter 45 JahreDeutscheInsgesamt",39653,9565,"24,1",24.121756235341589]
["NDIIInsgesamt35 bis unter 45 JahreDeutscheKeine Berufsausbildung",22787,5825,"25,6",25.562820906657301]
["NDIIInsgesamt35 bis unter 45 JahreDeutscheBetriebliche/schulische Ausbildung",14917,3374,"22,6",22.618488972313468]
["NDIIInsgesamt35 bis unter 45 JahreDeutscheAkademische Ausbildung",1949,366,"18,8",18.778860954335556]
["NDIIInsgesamt35 bis unter 45 JahreAusländerInsgesamt",61670,12487,"20,2",20.248094697583916]
["NDIIInsgesamt35 bis unter 45 JahreAusländerKeine Berufsausbildung",50592,10050,"19,9",19.864800759013281]
["NDIIInsgesamt35 bis unter 45 JahreAusländerBetriebliche/schulische Ausbildung",4766,1153,"24,2",24.192194712547209]
["NDIIInsgesamt35 bis unter 45 JahreAusländerAkademische Ausbildung",6312,1284,"20,3",20.342205323193916]
["NDIIInsgesamt45 bis unter 55 JahreInsgesamtInsgesamt",75448,16043,"21,3",21.263651786661011]
["NDIIInsgesamt45 bis unter 55 JahreInsgesamtKeine Berufsausbildung",52464,11166,"21,3",21.28316559926807]
["NDIIInsgesamt45 bis unter 55 JahreInsgesamtBetriebliche/schulische Ausbildung",18708,3991,"21,3",21.33311952106051]
["NDIIInsgesamt45 bis unter 55 JahreInsgesamtAkademische Ausbildung",4276,886,"20,7",20.720299345182415]
["NDIIInsgesamt45 bis unter 55 JahreDeutscheInsgesamt",36138,7549,"20,9",20.889368531739443]
["NDIIInsgesamt45 bis unter 55 JahreDeutscheKeine Berufsausbildung",19586,4112,"21,0",20.994587970999692]
["NDIIInsgesamt45 bis unter 55 JahreDeutscheBetriebliche/schulische Ausbildung",15097,3128,"20,7",20.71934821487713]
["NDIIInsgesamt45 bis unter 55 JahreDeutscheAkademische Ausbildung",1455,309,"21,2",21.237113402061855]
["NDIIInsgesamt45 bis unter 55 JahreAusländerInsgesamt",39307,8494,"21,6",21.609382552725979]
["NDIIInsgesamt45 bis unter 55 JahreAusländerKeine Berufsausbildung",32876,7054,"21,5",21.456381554933689]
["NDIIInsgesamt45 bis unter 55 JahreAusländerBetriebliche/schulische Ausbildung",3610,863,"23,9",23.905817174515235]
["NDIIInsgesamt45 bis unter 55 JahreAusländerAkademische Ausbildung",2821,577,"20,5",20.453739808578518]
["NDIIInsgesamt55 und älterInsgesamtInsgesamt",56312,12665,"22,5",22.490765733769003]
["NDIIInsgesamt55 und älterInsgesamtKeine Berufsausbildung",37263,8084,"21,7",21.694442208088454]
["NDIIInsgesamt55 und älterInsgesamtBetriebliche/schulische Ausbildung",16461,3856,"23,4",23.42506530587449]
["NDIIInsgesamt55 und älterInsgesamtAkademische Ausbildung",2588,725,"28,0",28.013910355486864]
["NDIIInsgesamt55 und älterDeutscheInsgesamt",34120,7422,"21,8",21.752637749120751]
["NDIIInsgesamt55 und älterDeutscheKeine Berufsausbildung",18316,3801,"20,8",20.752347674164664]
["NDIIInsgesamt55 und älterDeutscheBetriebliche/schulische Ausbildung",14557,3273,"22,5",22.484028302534863]
["NDIIInsgesamt55 und älterDeutscheAkademische Ausbildung",1247,348,"27,9",27.906976744186046]
["NDIIInsgesamt55 und älterAusländerInsgesamt",22191,5243,"23,6",23.626695507187598]
["NDIIInsgesamt55 und älterAusländerKeine Berufsausbildung",18946,4283,"22,6",22.606354903409688]
["NDIIInsgesamt55 und älterAusländerBetriebliche/schulische Ausbildung",1904,583,"30,6",30.619747899159666]
["NDIIInsgesamt55 und älterAusländerAkademische Ausbildung",1341,377,"28,1",28.113348247576436]
["NDIIMännlichInsgesamtInsgesamtInsgesamt",197209,39497,"20,0",20.027990608947867]
["NDIIMännlichInsgesamtInsgesamtKeine Berufsausbildung",147469,28744,"19,5",19.49155415714489]
["NDIIMännlichInsgesamtInsgesamtBetriebliche/schulische Ausbildung",39621,8956,"22,6",22.604174553898186]
["NDIIMännlichInsgesamtInsgesamtAkademische Ausbildung",10119,1797,"17,8",17.758671805514378]
["NDIIMännlichInsgesamtDeutscheInsgesamt",101502,21982,"21,7",21.656716123820221]
["NDIIMännlichInsgesamtDeutscheKeine Berufsausbildung",64605,13807,"21,4",21.37141088151072]
["NDIIMännlichInsgesamtDeutscheBetriebliche/schulische Ausbildung",32880,7450,"22,7",22.658150851581507]
["NDIIMännlichInsgesamtDeutscheAkademische Ausbildung",4017,725,"18,0",18.048294747323872]
["NDIIMännlichInsgesamtAusländerInsgesamt",95703,17515,"18,3",18.301411658986659]
["NDIIMännlichInsgesamtAusländerKeine Berufsausbildung",82861,14937,"18,0",18.026574624974355]
["NDIIMännlichInsgesamtAusländerBetriebliche/schulische Ausbildung",6740,1506,"22,3",22.344213649851632]
["NDIIMännlichInsgesamtAusländerAkademische Ausbildung",6102,1072,"17,6",17.568010488364472]
["NDIIMännlich15 bis unter 25 JahreInsgesamtInsgesamt",37415,4110,"11,0",10.984899104637178]
["NDIIMännlich15 bis unter 25 JahreInsgesamtKeine Berufsausbildung",35315,3905,"11,1",11.057624238991929]
["NDIIMännlich15 bis unter 25 JahreInsgesamtBetriebliche/schulische Ausbildung",1781,185,"10,4",10.387422796181921]
["NDIIMännlich15 bis unter 25 JahreInsgesamtAkademische Ausbildung",319,20,"6,3",6.2695924764890272]
["NDIIMännlich15 bis unter 25 JahreDeutscheInsgesamt",18133,2325,"12,8",12.821926873655764]
["NDIIMännlich15 bis unter 25 JahreDeutscheKeine Berufsausbildung",16823,2186,"13,0",12.994115199429352]
["NDIIMännlich15 bis unter 25 JahreDeutscheBetriebliche/schulische Ausbildung",1221,135,"11,1",11.056511056511056]
["NDIIMännlich15 bis unter 25 JahreDeutscheAkademische Ausbildung",89,4,"4,5",4.4943820224719104]
["NDIIMännlich15 bis unter 25 JahreAusländerInsgesamt",19281,1785,"9,3",9.2578185778745929]
["NDIIMännlich15 bis unter 25 JahreAusländerKeine Berufsausbildung",18491,1719,"9,3",9.2964144719052513]
["NDIIMännlich15 bis unter 25 JahreAusländerBetriebliche/schulische Ausbildung",560,50,"8,9",8.9285714285714288]
["NDIIMännlich15 bis unter 25 JahreAusländerAkademische Ausbildung","*","*","7,0",6.9565217391304346]
["NDIIMännlich25 bis unter 35 JahreInsgesamtInsgesamt",52418,10571,"20,2",20.166736617192569]
["NDIIMännlich25 bis unter 35 JahreInsgesamtKeine Berufsausbildung",40030,8316,"20,8",20.774419185610792]
["NDIIMännlich25 bis unter 35 JahreInsgesamtBetriebliche/schulische Ausbildung",8773,1813,"20,7",20.665678787187964]
["NDIIMännlich25 bis unter 35 JahreInsgesamtAkademische Ausbildung",3615,442,"12,2",12.2268326417704]
["NDIIMännlich25 bis unter 35 JahreDeutscheInsgesamt",25614,5786,"22,6",22.589209026313732]
["NDIIMännlich25 bis unter 35 JahreDeutscheKeine Berufsausbildung",17125,4168,"24,3",24.338686131386861]
["NDIIMännlich25 bis unter 35 JahreDeutscheBetriebliche/schulische Ausbildung",6959,1458,"21,0",20.951286104325334]
["NDIIMännlich25 bis unter 35 JahreDeutscheAkademische Ausbildung",1530,160,"10,5",10.457516339869281]
["NDIIMännlich25 bis unter 35 JahreAusländerInsgesamt",26803,4785,"17,9",17.85247920008954]
["NDIIMännlich25 bis unter 35 JahreAusländerKeine Berufsausbildung",22904,4148,"18,1",18.110373733845616]
["NDIIMännlich25 bis unter 35 JahreAusländerBetriebliche/schulische Ausbildung",1814,355,"19,6",19.570011025358326]
["NDIIMännlich25 bis unter 35 JahreAusländerAkademische Ausbildung",2085,282,"13,5",13.525179856115107]
["NDIIMännlich35 bis unter 45 JahreInsgesamtInsgesamt",45440,10280,"22,6",22.62323943661972]
["NDIIMännlich35 bis unter 45 JahreInsgesamtKeine Berufsausbildung",32383,7375,"22,8",22.774295154865207]
["NDIIMännlich35 bis unter 45 JahreInsgesamtBetriebliche/schulische Ausbildung",9892,2307,"23,3",23.321876263647393]
["NDIIMännlich35 bis unter 45 JahreInsgesamtAkademische Ausbildung",3165,598,"18,9",18.894154818325433]
["NDIIMännlich35 bis unter 45 JahreDeutscheInsgesamt",20718,5212,"25,2",25.156868423593011]
["NDIIMännlich35 bis unter 45 JahreDeutscheKeine Berufsausbildung",11894,3185,"26,8",26.778207499579622]
["NDIIMännlich35 bis unter 45 JahreDeutscheBetriebliche/schulische Ausbildung",7877,1838,"23,3",23.333756506284118]
["NDIIMännlich35 bis unter 45 JahreDeutscheAkademische Ausbildung",947,189,"20,0",19.957761351636748]
["NDIIMännlich35 bis unter 45 JahreAusländerInsgesamt",24722,5068,"20,5",20.499959550198206]
["NDIIMännlich35 bis unter 45 JahreAusländerKeine Berufsausbildung",20489,4190,"20,4",20.449997559666162]
["NDIIMännlich35 bis unter 45 JahreAusländerBetriebliche/schulische Ausbildung",2015,469,"23,3",23.275434243176178]
["NDIIMännlich35 bis unter 45 JahreAusländerAkademische Ausbildung",2218,409,"18,4",18.440036068530208]
["NDIIMännlich45 bis unter 55 JahreInsgesamtInsgesamt",34858,7987,"22,9",22.912961156692869]
["NDIIMännlich45 bis unter 55 JahreInsgesamtKeine Berufsausbildung",23027,5255,"22,8",22.821036174925087]
["NDIIMännlich45 bis unter 55 JahreInsgesamtBetriebliche/schulische Ausbildung",10013,2334,"23,3",23.309697393388596]
["NDIIMännlich45 bis unter 55 JahreInsgesamtAkademische Ausbildung",1818,398,"21,9",21.892189218921892]
["NDIIMännlich45 bis unter 55 JahreDeutscheInsgesamt",19057,4370,"22,9",22.931206380857429]
["NDIIMännlich45 bis unter 55 JahreDeutscheKeine Berufsausbildung",9723,2235,"23,0",22.98673248997223]
["NDIIMännlich45 bis unter 55 JahreDeutscheBetriebliche/schulische Ausbildung",8557,1954,"22,8",22.835105761364964]
["NDIIMännlich45 bis unter 55 JahreDeutscheAkademische Ausbildung",777,181,"23,3",23.294723294723294]
["NDIIMännlich45 bis unter 55 JahreAusländerInsgesamt",15800,3617,"22,9",22.89240506329114]
["NDIIMännlich45 bis unter 55 JahreAusländerKeine Berufsausbildung",13304,3020,"22,7",22.699939867708959]
["NDIIMännlich45 bis unter 55 JahreAusländerBetriebliche/schulische Ausbildung",1455,380,"26,1",26.116838487972512]
["NDIIMännlich45 bis unter 55 JahreAusländerAkademische Ausbildung",1041,217,"20,8",20.845341018251681]
["NDIIMännlich55 und älterInsgesamtInsgesamt",27078,6549,"24,2",24.185685796587634]
["NDIIMännlich55 und älterInsgesamtKeine Berufsausbildung",16714,3893,"23,3",23.291851142754577]
["NDIIMännlich55 und älterInsgesamtBetriebliche/schulische Ausbildung",9162,2317,"25,3",25.289238157607507]
["NDIIMännlich55 und älterInsgesamtAkademische Ausbildung",1202,339,"28,2",28.202995008319469]
["NDIIMännlich55 und älterDeutscheInsgesamt",17980,4289,"23,9",23.854282536151281]
["NDIIMännlich55 und älterDeutscheKeine Berufsausbildung",9040,2033,"22,5",22.488938053097346]
["NDIIMännlich55 und älterDeutscheBetriebliche/schulische Ausbildung",8266,2065,"25,0",24.981853375272202]
["NDIIMännlich55 und älterDeutscheAkademische Ausbildung",674,191,"28,3",28.338278931750743]
["NDIIMännlich55 und älterAusländerInsgesamt",9097,2260,"24,8",24.843354952182036]
["NDIIMännlich55 und älterAusländerKeine Berufsausbildung",7673,1860,"24,2",24.240844519744559]
["NDIIMännlich55 und älterAusländerBetriebliche/schulische Ausbildung",896,252,"28,1",28.125]
["NDIIMännlich55 und älterAusländerAkademische Ausbildung",528,148,"28,0",28.030303030303028]
["NDIIWeiblichInsgesamtInsgesamtInsgesamt",211500,39765,"18,8",18.801418439716311]
["NDIIWeiblichInsgesamtInsgesamtKeine Berufsausbildung",160936,29725,"18,5",18.47007506089377]
["NDIIWeiblichInsgesamtInsgesamtBetriebliche/schulische Ausbildung",35798,7307,"20,4",20.411754846639475]
["NDIIWeiblichInsgesamtInsgesamtAkademische Ausbildung",14766,2733,"18,5",18.508736286062579]
["NDIIWeiblichInsgesamtDeutscheInsgesamt",90577,17591,"19,4",19.421045077668726]
["NDIIWeiblichInsgesamtDeutscheKeine Berufsausbildung",58937,11675,"19,8",19.809287883672397]
["NDIIWeiblichInsgesamtDeutscheBetriebliche/schulische Ausbildung",27385,5271,"19,2",19.247763374109912]
["NDIIWeiblichInsgesamtDeutscheAkademische Ausbildung",4255,645,"15,2",15.158636897767334]
["NDIIWeiblichInsgesamtAusländerInsgesamt",120921,22174,"18,3",18.337592312336152]
["NDIIWeiblichInsgesamtAusländerKeine Berufsausbildung",101997,18050,"17,7",17.696598919576065]
["NDIIWeiblichInsgesamtAusländerBetriebliche/schulische Ausbildung",8413,2036,"24,2",24.200641863782241]
["NDIIWeiblichInsgesamtAusländerAkademische Ausbildung",10511,2088,"19,9",19.864903434497194]
["NDIIWeiblich15 bis unter 25 JahreInsgesamtInsgesamt",32789,3206,"9,8",9.7776693403275488]
["NDIIWeiblich15 bis unter 25 JahreInsgesamtKeine Berufsausbildung",29966,2961,"9,9",9.8811986918507628]
["NDIIWeiblich15 bis unter 25 JahreInsgesamtBetriebliche/schulische Ausbildung",2044,187,"9,1",9.148727984344422]
["NDIIWeiblich15 bis unter 25 JahreInsgesamtAkademische Ausbildung",779,58,"7,4",7.4454428754813868]
["NDIIWeiblich15 bis unter 25 JahreDeutscheInsgesamt",16030,1923,"12,0",11.996257018091079]
["NDIIWeiblich15 bis unter 25 JahreDeutscheKeine Berufsausbildung",14487,1796,"12,4",12.397321736729481]
["NDIIWeiblich15 bis unter 25 JahreDeutscheBetriebliche/schulische Ausbildung",1361,118,"8,7",8.6700955180014692]
["NDIIWeiblich15 bis unter 25 JahreDeutscheAkademische Ausbildung",182,9,"4,9",4.9450549450549453]
["NDIIWeiblich15 bis unter 25 JahreAusländerInsgesamt",16759,1283,"7,7",7.6555880422459577]
["NDIIWeiblich15 bis unter 25 JahreAusländerKeine Berufsausbildung",15479,1165,"7,5",7.5263259900510375]
["NDIIWeiblich15 bis unter 25 JahreAusländerBetriebliche/schulische Ausbildung",683,69,"10,1",10.102489019033674]
["NDIIWeiblich15 bis unter 25 JahreAusländerAkademische Ausbildung","*","*","8,2",8.2077051926298168]
["NDIIWeiblich25 bis unter 35 JahreInsgesamtInsgesamt",53004,10615,"20,0",20.026790430910875]
["NDIIWeiblich25 bis unter 35 JahreInsgesamtKeine Berufsausbildung",39988,8162,"20,4",20.411123337001101]
["NDIIWeiblich25 bis unter 35 JahreInsgesamtBetriebliche/schulische Ausbildung",7969,1704,"21,4",21.382858576985818]
["NDIIWeiblich25 bis unter 35 JahreInsgesamtAkademische Ausbildung",5047,749,"14,8",14.840499306518723]
["NDIIWeiblich25 bis unter 35 JahreDeutscheInsgesamt",22391,5003,"22,3",22.34379884775133]
["NDIIWeiblich25 bis unter 35 JahreDeutscheKeine Berufsausbildung",14418,3594,"24,9",24.927174365376612]
["NDIIWeiblich25 bis unter 35 JahreDeutscheBetriebliche/schulische Ausbildung",6153,1235,"20,1",20.071509832601983]
["NDIIWeiblich25 bis unter 35 JahreDeutscheAkademische Ausbildung",1820,174,"9,6",9.5604395604395602]
["NDIIWeiblich25 bis unter 35 JahreAusländerInsgesamt",30613,5612,"18,3",18.332081141998497]
["NDIIWeiblich25 bis unter 35 JahreAusländerKeine Berufsausbildung",25570,4568,"17,9",17.864685177942903]
["NDIIWeiblich25 bis unter 35 JahreAusländerBetriebliche/schulische Ausbildung",1816,469,"25,8",25.82599118942731]
["NDIIWeiblich25 bis unter 35 JahreAusländerAkademische Ausbildung",3227,575,"17,8",17.818407189339943]
["NDIIWeiblich35 bis unter 45 JahreInsgesamtInsgesamt",55883,11772,"21,1",21.065440294901848]
["NDIIWeiblich35 bis unter 45 JahreInsgesamtKeine Berufsausbildung",40996,8500,"20,7",20.73373012001171]
["NDIIWeiblich35 bis unter 45 JahreInsgesamtBetriebliche/schulische Ausbildung",9791,2220,"22,7",22.673884179348381]
["NDIIWeiblich35 bis unter 45 JahreInsgesamtAkademische Ausbildung",5096,1052,"20,6",20.643642072213499]
["NDIIWeiblich35 bis unter 45 JahreDeutscheInsgesamt",18935,4353,"23,0",22.989173488249275]
["NDIIWeiblich35 bis unter 45 JahreDeutscheKeine Berufsausbildung",10893,2640,"24,2",24.235747727898652]
["NDIIWeiblich35 bis unter 45 JahreDeutscheBetriebliche/schulische Ausbildung",7040,1536,"21,8",21.818181818181817]
["NDIIWeiblich35 bis unter 45 JahreDeutscheAkademische Ausbildung",1002,177,"17,7",17.664670658682635]
["NDIIWeiblich35 bis unter 45 JahreAusländerInsgesamt",36948,7419,"20,1",20.079571289379668]
["NDIIWeiblich35 bis unter 45 JahreAusländerKeine Berufsausbildung",30103,5860,"19,5",19.466498355645616]
["NDIIWeiblich35 bis unter 45 JahreAusländerBetriebliche/schulische Ausbildung",2751,684,"24,9",24.863685932388222]
["NDIIWeiblich35 bis unter 45 JahreAusländerAkademische Ausbildung",4094,875,"21,4",21.372740595994138]
["NDIIWeiblich45 bis unter 55 JahreInsgesamtInsgesamt",40590,8056,"19,8",19.847253017984727]
["NDIIWeiblich45 bis unter 55 JahreInsgesamtKeine Berufsausbildung",29437,5911,"20,1",20.08017121309916]
["NDIIWeiblich45 bis unter 55 JahreInsgesamtBetriebliche/schulische Ausbildung",8695,1657,"19,1",19.056929269695228]
["NDIIWeiblich45 bis unter 55 JahreInsgesamtAkademische Ausbildung",2458,488,"19,9",19.853539462978031]
["NDIIWeiblich45 bis unter 55 JahreDeutscheInsgesamt",17081,3179,"18,6",18.611322522100579]
["NDIIWeiblich45 bis unter 55 JahreDeutscheKeine Berufsausbildung",9863,1877,"19,0",19.030720876001219]
["NDIIWeiblich45 bis unter 55 JahreDeutscheBetriebliche/schulische Ausbildung",6540,1174,"18,0",17.951070336391435]
["NDIIWeiblich45 bis unter 55 JahreDeutscheAkademische Ausbildung",678,128,"18,9",18.87905604719764]
["NDIIWeiblich45 bis unter 55 JahreAusländerInsgesamt",23507,4877,"20,7",20.747011528480876]
["NDIIWeiblich45 bis unter 55 JahreAusländerKeine Berufsausbildung",19572,4034,"20,6",20.611077048845289]
["NDIIWeiblich45 bis unter 55 JahreAusländerBetriebliche/schulische Ausbildung",2155,483,"22,4",22.412993039443155]
["NDIIWeiblich45 bis unter 55 JahreAusländerAkademische Ausbildung",1780,360,"20,2",20.224719101123593]
["NDIIWeiblich55 und älterInsgesamtInsgesamt",29234,6116,"20,9",20.920845590750496]
["NDIIWeiblich55 und älterInsgesamtKeine Berufsausbildung",20549,4191,"20,4",20.395153048810162]
["NDIIWeiblich55 und älterInsgesamtBetriebliche/schulische Ausbildung",7299,1539,"21,1",21.085080147965474]
["NDIIWeiblich55 und älterInsgesamtAkademische Ausbildung",1386,386,"27,8",27.849927849927852]
["NDIIWeiblich55 und älterDeutscheInsgesamt",16140,3133,"19,4",19.411400247831477]
["NDIIWeiblich55 und älterDeutscheKeine Berufsausbildung",9276,1768,"19,1",19.059939629150495]
["NDIIWeiblich55 und älterDeutscheBetriebliche/schulische Ausbildung",6291,1208,"19,2",19.202034652678428]
["NDIIWeiblich55 und älterDeutscheAkademische Ausbildung",573,157,"27,4",27.399650959860384]
["NDIIWeiblich55 und älterAusländerInsgesamt",13094,2983,"22,8",22.781426607606537]
["NDIIWeiblich55 und älterAusländerKeine Berufsausbildung",11273,2423,"21,5",21.493834826576776]
["NDIIWeiblich55 und älterAusländerBetriebliche/schulische Ausbildung",1008,331,"32,8",32.837301587301589]
["NDIIWeiblich55 und älterAusländerAkademische Ausbildung",813,229,"28,2",28.167281672816731]
["ODInsgesamtInsgesamtInsgesamtInsgesamtInsgesamt",1048641,153984,"14,7",14.684148340566505]
["ODInsgesamtInsgesamtInsgesamtInsgesamtKeine Berufsausbildung",492034,75759,"15,4",15.397106704008259]
["ODInsgesamtInsgesamtInsgesamtInsgesamtBetriebliche/schulische Ausbildung",416990,63944,"15,3",15.334660303604403]
["ODInsgesamtInsgesamtInsgesamtInsgesamtAkademische Ausbildung",139617,14281,"10,2",10.228697078436007]
["ODInsgesamtInsgesamtInsgesamtDeutscheInsgesamt",725674,109378,"15,1",15.072608361330294]
["ODInsgesamtInsgesamtInsgesamtDeutscheKeine Berufsausbildung",250963,42135,"16,8",16.789327510429825]
["ODInsgesamtInsgesamtInsgesamtDeutscheBetriebliche/schulische Ausbildung",383663,58438,"15,2",15.2315964792018]
["ODInsgesamtInsgesamtInsgesamtDeutscheAkademische Ausbildung",91048,8805,"9,7",9.670723135049645]
["ODInsgesamtInsgesamtInsgesamtAusländerInsgesamt",322965,44606,"13,8",13.811403712476583]
["ODInsgesamtInsgesamtInsgesamtAusländerKeine Berufsausbildung",241070,33624,"13,9",13.947815987057702]
["ODInsgesamtInsgesamtInsgesamtAusländerBetriebliche/schulische Ausbildung",33327,5506,"16,5",16.52113901641312]
["ODInsgesamtInsgesamtInsgesamtAusländerAkademische Ausbildung",48568,5476,"11,3",11.274913523307529]
["ODInsgesamtInsgesamt15 bis unter 25 JahreInsgesamtInsgesamt",157711,13047,"8,3",8.2727266962989265]
["ODInsgesamtInsgesamt15 bis unter 25 JahreInsgesamtKeine Berufsausbildung",119240,11127,"9,3",9.3316001341831605]
["ODInsgesamtInsgesamt15 bis unter 25 JahreInsgesamtBetriebliche/schulische Ausbildung",34972,1782,"5,1",5.0955049754088986]
["ODInsgesamtInsgesamt15 bis unter 25 JahreInsgesamtAkademische Ausbildung",3499,138,"3,9",3.9439839954272653]
["ODInsgesamtInsgesamt15 bis unter 25 JahreDeutscheInsgesamt",110367,9593,"8,7",8.6919097193907593]
["ODInsgesamtInsgesamt15 bis unter 25 JahreDeutscheKeine Berufsausbildung",76003,7956,"10,5",10.468007841795719]
["ODInsgesamtInsgesamt15 bis unter 25 JahreDeutscheBetriebliche/schulische Ausbildung",32262,1588,"4,9",4.9221994916620178]
["ODInsgesamtInsgesamt15 bis unter 25 JahreDeutscheAkademische Ausbildung",2102,49,"2,3",2.3311132254995242]
["ODInsgesamtInsgesamt15 bis unter 25 JahreAusländerInsgesamt",47344,3454,"7,3",7.2955390334572492]
["ODInsgesamtInsgesamt15 bis unter 25 JahreAusländerKeine Berufsausbildung",43237,3171,"7,3",7.3339963457224142]
["ODInsgesamtInsgesamt15 bis unter 25 JahreAusländerBetriebliche/schulische Ausbildung",2710,194,"7,2",7.158671586715867]
["ODInsgesamtInsgesamt15 bis unter 25 JahreAusländerAkademische Ausbildung",1397,89,"6,4",6.3707945597709381]
["ODInsgesamtInsgesamt25 bis unter 35 JahreInsgesamtInsgesamt",261504,33612,"12,9",12.85334067547724]
["ODInsgesamtInsgesamt25 bis unter 35 JahreInsgesamtKeine Berufsausbildung",130200,21314,"16,4",16.370199692780339]
["ODInsgesamtInsgesamt25 bis unter 35 JahreInsgesamtBetriebliche/schulische Ausbildung",78970,8845,"11,2",11.200455869317462]
["ODInsgesamtInsgesamt25 bis unter 35 JahreInsgesamtAkademische Ausbildung",52334,3453,"6,6",6.5980051209538733]
["ODInsgesamtInsgesamt25 bis unter 35 JahreDeutscheInsgesamt",164582,21299,"12,9",12.941269397625499]
["ODInsgesamtInsgesamt25 bis unter 35 JahreDeutscheKeine Berufsausbildung",61815,11961,"19,3",19.349672409609315]
["ODInsgesamtInsgesamt25 bis unter 35 JahreDeutscheBetriebliche/schulische Ausbildung",70166,7656,"10,9",10.911267565487558]
["ODInsgesamtInsgesamt25 bis unter 35 JahreDeutscheAkademische Ausbildung",32601,1682,"5,2",5.1593509401552096]
["ODInsgesamtInsgesamt25 bis unter 35 JahreAusländerInsgesamt",96922,12313,"12,7",12.704030044778275]
["ODInsgesamtInsgesamt25 bis unter 35 JahreAusländerKeine Berufsausbildung",68385,9353,"13,7",13.676975945017183]
["ODInsgesamtInsgesamt25 bis unter 35 JahreAusländerBetriebliche/schulische Ausbildung",8804,1189,"13,5",13.50522489777374]
["ODInsgesamtInsgesamt25 bis unter 35 JahreAusländerAkademische Ausbildung",19733,1771,"9,0",8.9748137637460097]
["ODInsgesamtInsgesamt35 bis unter 45 JahreInsgesamtInsgesamt",263357,38549,"14,6",14.637545233276503]
["ODInsgesamtInsgesamt35 bis unter 45 JahreInsgesamtKeine Berufsausbildung",115780,20443,"17,7",17.656762826049405]
["ODInsgesamtInsgesamt35 bis unter 45 JahreInsgesamtBetriebliche/schulische Ausbildung",101644,13992,"13,8",13.765692023139586]
["ODInsgesamtInsgesamt35 bis unter 45 JahreInsgesamtAkademische Ausbildung",45933,4114,"9,0",8.9565236322469683]
["ODInsgesamtInsgesamt35 bis unter 45 JahreDeutscheInsgesamt",172028,25111,"14,6",14.597042341944336]
["ODInsgesamtInsgesamt35 bis unter 45 JahreDeutscheKeine Berufsausbildung",52067,10652,"20,5",20.45825570899034]
["ODInsgesamtInsgesamt35 bis unter 45 JahreDeutscheBetriebliche/schulische Ausbildung",91922,12382,"13,5",13.470115967885816]
["ODInsgesamtInsgesamt35 bis unter 45 JahreDeutscheAkademische Ausbildung",28039,2077,"7,4",7.4075394985555834]
["ODInsgesamtInsgesamt35 bis unter 45 JahreAusländerInsgesamt",91329,13438,"14,7",14.713836787876797]
["ODInsgesamtInsgesamt35 bis unter 45 JahreAusländerKeine Berufsausbildung",63713,9791,"15,4",15.36735046222906]
["ODInsgesamtInsgesamt35 bis unter 45 JahreAusländerBetriebliche/schulische Ausbildung",9722,1610,"16,6",16.560378522937665]
["ODInsgesamtInsgesamt35 bis unter 45 JahreAusländerAkademische Ausbildung",17894,2037,"11,4",11.383704034872025]
["ODInsgesamtInsgesamt45 bis unter 55 JahreInsgesamtInsgesamt",179415,27607,"15,4",15.387230722068946]
["ODInsgesamtInsgesamt45 bis unter 55 JahreInsgesamtKeine Berufsausbildung",72497,12398,"17,1",17.101397299198588]
["ODInsgesamtInsgesamt45 bis unter 55 JahreInsgesamtBetriebliche/schulische Ausbildung",87707,12986,"14,8",14.806115817437604]
["ODInsgesamtInsgesamt45 bis unter 55 JahreInsgesamtAkademische Ausbildung",19211,2223,"11,6",11.571495497371298]
["ODInsgesamtInsgesamt45 bis unter 55 JahreDeutscheInsgesamt",123398,18284,"14,8",14.81709590106809]
["ODInsgesamtInsgesamt45 bis unter 55 JahreDeutscheKeine Berufsausbildung",30711,5445,"17,7",17.729803653414088]
["ODInsgesamtInsgesamt45 bis unter 55 JahreDeutscheBetriebliche/schulische Ausbildung",79977,11574,"14,5",14.471660602423198]
["ODInsgesamtInsgesamt45 bis unter 55 JahreDeutscheAkademische Ausbildung",12710,1265,"10,0",9.9527930763178603]
["ODInsgesamtInsgesamt45 bis unter 55 JahreAusländerInsgesamt",56015,9323,"16,6",16.643756136749086]
["ODInsgesamtInsgesamt45 bis unter 55 JahreAusländerKeine Berufsausbildung",41785,6953,"16,6",16.639942563120737]
["ODInsgesamtInsgesamt45 bis unter 55 JahreAusländerBetriebliche/schulische Ausbildung",7730,1412,"18,3",18.266494178525228]
["ODInsgesamtInsgesamt45 bis unter 55 JahreAusländerAkademische Ausbildung",6500,958,"14,7",14.738461538461539]
["ODInsgesamtInsgesamt55 und älterInsgesamtInsgesamt",186654,41169,"22,1",22.05631810730014]
["ODInsgesamtInsgesamt55 und älterInsgesamtKeine Berufsausbildung",54317,10477,"19,3",19.28862050555075]
["ODInsgesamtInsgesamt55 und älterInsgesamtBetriebliche/schulische Ausbildung",113697,26339,"23,2",23.165958644467313]
["ODInsgesamtInsgesamt55 und älterInsgesamtAkademische Ausbildung",18640,4353,"23,4",23.353004291845494]
["ODInsgesamtInsgesamt55 und älterDeutscheInsgesamt",155299,35091,"22,6",22.59576687551111]
["ODInsgesamtInsgesamt55 und älterDeutscheKeine Berufsausbildung",30367,6121,"20,2",20.156749102644316]
["ODInsgesamtInsgesamt55 und älterDeutscheBetriebliche/schulische Ausbildung",109336,25238,"23,1",23.082973586010098]
["ODInsgesamtInsgesamt55 und älterDeutscheAkademische Ausbildung",15596,3732,"23,9",23.929212618620159]
["ODInsgesamtInsgesamt55 und älterAusländerInsgesamt",31355,6078,"19,4",19.384468186892043]
["ODInsgesamtInsgesamt55 und älterAusländerKeine Berufsausbildung",23950,4356,"18,2",18.187891440501044]
["ODInsgesamtInsgesamt55 und älterAusländerBetriebliche/schulische Ausbildung",4361,1101,"25,2",25.24650309562027]
["ODInsgesamtInsgesamt55 und älterAusländerAkademische Ausbildung",3044,621,"20,4",20.400788436268069]
["ODInsgesamtMännlichInsgesamtInsgesamtInsgesamt",543397,83961,"15,5",15.451134253593599]
["ODInsgesamtMännlichInsgesamtInsgesamtKeine Berufsausbildung",256211,41130,"16,1",16.053174922232067]
["ODInsgesamtMännlichInsgesamtInsgesamtBetriebliche/schulische Ausbildung",227271,36099,"15,9",15.883680715973442]
["ODInsgesamtMännlichInsgesamtInsgesamtAkademische Ausbildung",59915,6732,"11,2",11.235917549862306]
["ODInsgesamtMännlichInsgesamtDeutscheInsgesamt",394927,63054,"16,0",15.965988651067159]
["ODInsgesamtMännlichInsgesamtDeutscheKeine Berufsausbildung",142741,24801,"17,4",17.374825733321188]
["ODInsgesamtMännlichInsgesamtDeutscheBetriebliche/schulische Ausbildung",211397,33668,"15,9",15.926432257789847]
["ODInsgesamtMännlichInsgesamtDeutscheAkademische Ausbildung",40789,4585,"11,2",11.240775699330701]
["ODInsgesamtMännlichInsgesamtAusländerInsgesamt",148469,20907,"14,1",14.081727498669755]
["ODInsgesamtMännlichInsgesamtAusländerKeine Berufsausbildung",113469,16329,"14,4",14.390714644528463]
["ODInsgesamtMännlichInsgesamtAusländerBetriebliche/schulische Ausbildung",15874,2431,"15,3",15.314350510268362]
["ODInsgesamtMännlichInsgesamtAusländerAkademische Ausbildung",19126,2147,"11,2",11.225556833629614]
["ODInsgesamtMännlich15 bis unter 25 JahreInsgesamtInsgesamt",88106,7623,"8,7",8.6520781785576464]
["ODInsgesamtMännlich15 bis unter 25 JahreInsgesamtKeine Berufsausbildung",67705,6600,"9,7",9.748172217709179]
["ODInsgesamtMännlich15 bis unter 25 JahreInsgesamtBetriebliche/schulische Ausbildung",19344,983,"5,1",5.0816790736145574]
["ODInsgesamtMännlich15 bis unter 25 JahreInsgesamtAkademische Ausbildung",1057,40,"3,8",3.7842951750236518]
["ODInsgesamtMännlich15 bis unter 25 JahreDeutscheInsgesamt",61966,5558,"9,0",8.9694348513701065]
["ODInsgesamtMännlich15 bis unter 25 JahreDeutscheKeine Berufsausbildung",43267,4649,"10,7",10.744909515335014]
["ODInsgesamtMännlich15 bis unter 25 JahreDeutscheBetriebliche/schulische Ausbildung",17990,889,"4,9",4.9416342412451364]
["ODInsgesamtMännlich15 bis unter 25 JahreDeutscheAkademische Ausbildung",709,20,"2,8",2.8208744710860367]
["ODInsgesamtMännlich15 bis unter 25 JahreAusländerInsgesamt",26140,2065,"7,9",7.8997704667176745]
["ODInsgesamtMännlich15 bis unter 25 JahreAusländerKeine Berufsausbildung",24438,1951,"8,0",7.9834683689336288]
["ODInsgesamtMännlich15 bis unter 25 JahreAusländerBetriebliche/schulische Ausbildung",1354,94,"6,9",6.9423929098966024]
["ODInsgesamtMännlich15 bis unter 25 JahreAusländerAkademische Ausbildung",348,20,"5,7",5.7471264367816088]
["ODInsgesamtMännlich25 bis unter 35 JahreInsgesamtInsgesamt",133723,18085,"13,5",13.524225451119104]
["ODInsgesamtMännlich25 bis unter 35 JahreInsgesamtKeine Berufsausbildung",70062,11769,"16,8",16.797978932945107]
["ODInsgesamtMännlich25 bis unter 35 JahreInsgesamtBetriebliche/schulische Ausbildung",42021,4794,"11,4",11.408581423573928]
["ODInsgesamtMännlich25 bis unter 35 JahreInsgesamtAkademische Ausbildung",21640,1522,"7,0",7.033271719038817]
["ODInsgesamtMännlich25 bis unter 35 JahreDeutscheInsgesamt",86748,12019,"13,9",13.855074468575646]
["ODInsgesamtMännlich25 bis unter 35 JahreDeutscheKeine Berufsausbildung",35440,6935,"19,6",19.568284424379232]
["ODInsgesamtMännlich25 bis unter 35 JahreDeutscheBetriebliche/schulische Ausbildung",37613,4251,"11,3",11.301943476989338]
["ODInsgesamtMännlich25 bis unter 35 JahreDeutscheAkademische Ausbildung",13695,833,"6,1",6.0825118656443955]
["ODInsgesamtMännlich25 bis unter 35 JahreAusländerInsgesamt",46975,6066,"12,9",12.913251729643427]
["ODInsgesamtMännlich25 bis unter 35 JahreAusländerKeine Berufsausbildung",34622,4834,"14,0",13.96222055340535]
["ODInsgesamtMännlich25 bis unter 35 JahreAusländerBetriebliche/schulische Ausbildung",4408,543,"12,3",12.318511796733214]
["ODInsgesamtMännlich25 bis unter 35 JahreAusländerAkademische Ausbildung",7945,689,"8,7",8.6721208307111386]
["ODInsgesamtMännlich35 bis unter 45 JahreInsgesamtInsgesamt",130850,20546,"15,7",15.701948796331678]
["ODInsgesamtMännlich35 bis unter 45 JahreInsgesamtKeine Berufsausbildung",57227,10868,"19,0",18.991035699931849]
["ODInsgesamtMännlich35 bis unter 45 JahreInsgesamtBetriebliche/schulische Ausbildung",54277,7908,"14,6",14.569707242478398]
["ODInsgesamtMännlich35 bis unter 45 JahreInsgesamtAkademische Ausbildung",19346,1770,"9,1",9.1491781246769364]
["ODInsgesamtMännlich35 bis unter 45 JahreDeutscheInsgesamt",93012,14781,"15,9",15.891497871242422]
["ODInsgesamtMännlich35 bis unter 45 JahreDeutscheKeine Berufsausbildung",30723,6570,"21,4",21.384630407186798]
["ODInsgesamtMännlich35 bis unter 45 JahreDeutscheBetriebliche/schulische Ausbildung",49919,7223,"14,5",14.469440493599631]
["ODInsgesamtMännlich35 bis unter 45 JahreDeutscheAkademische Ausbildung",12370,988,"8,0",7.9870654810024257]
["ODInsgesamtMännlich35 bis unter 45 JahreAusländerInsgesamt",37838,5765,"15,2",15.236006131402293]
["ODInsgesamtMännlich35 bis unter 45 JahreAusländerKeine Berufsausbildung",26504,4298,"16,2",16.216420162994265]
["ODInsgesamtMännlich35 bis unter 45 JahreAusländerBetriebliche/schulische Ausbildung",4358,685,"15,7",15.718219366681966]
["ODInsgesamtMännlich35 bis unter 45 JahreAusländerAkademische Ausbildung",6976,782,"11,2",11.209862385321101]
["ODInsgesamtMännlich45 bis unter 55 JahreInsgesamtInsgesamt",91083,15150,"16,6",16.633180725272553]
["ODInsgesamtMännlich45 bis unter 55 JahreInsgesamtKeine Berufsausbildung",34448,6396,"18,6",18.567115652577797]
["ODInsgesamtMännlich45 bis unter 55 JahreInsgesamtBetriebliche/schulische Ausbildung",48242,7678,"15,9",15.915592222544669]
["ODInsgesamtMännlich45 bis unter 55 JahreInsgesamtAkademische Ausbildung",8393,1076,"12,8",12.820207315620161]
["ODInsgesamtMännlich45 bis unter 55 JahreDeutscheInsgesamt",67766,11016,"16,3",16.255939556709855]
["ODInsgesamtMännlich45 bis unter 55 JahreDeutscheKeine Berufsausbildung",17047,3248,"19,1",19.053205842670266]
["ODInsgesamtMännlich45 bis unter 55 JahreDeutscheBetriebliche/schulische Ausbildung",44781,7076,"15,8",15.801344320135771]
["ODInsgesamtMännlich45 bis unter 55 JahreDeutscheAkademische Ausbildung",5938,692,"11,7",11.653755473223308]
["ODInsgesamtMännlich45 bis unter 55 JahreAusländerInsgesamt",23316,4134,"17,7",17.730313947503859]
["ODInsgesamtMännlich45 bis unter 55 JahreAusländerKeine Berufsausbildung",17400,3148,"18,1",18.091954022988503]
["ODInsgesamtMännlich45 bis unter 55 JahreAusländerBetriebliche/schulische Ausbildung",3461,602,"17,4",17.393816815949148]
["ODInsgesamtMännlich45 bis unter 55 JahreAusländerAkademische Ausbildung",2455,384,"15,6",15.64154786150713]
["ODInsgesamtMännlich55 und älterInsgesamtInsgesamt",99635,22557,"22,6",22.639634666532846]
["ODInsgesamtMännlich55 und älterInsgesamtKeine Berufsausbildung",26769,5497,"20,5",20.534947140348912]
["ODInsgesamtMännlich55 und älterInsgesamtBetriebliche/schulische Ausbildung",63387,14736,"23,2",23.247669080410809]
["ODInsgesamtMännlich55 und älterInsgesamtAkademische Ausbildung",9479,2324,"24,5",24.517354151281783]
["ODInsgesamtMännlich55 und älterDeutscheInsgesamt",85435,19680,"23,0",23.035055890443026]
["ODInsgesamtMännlich55 und älterDeutscheKeine Berufsausbildung",16264,3399,"20,9",20.898917855386127]
["ODInsgesamtMännlich55 und älterDeutscheBetriebliche/schulische Ausbildung",61094,14229,"23,3",23.290339476871704]
["ODInsgesamtMännlich55 und älterDeutscheAkademische Ausbildung",8077,2052,"25,4",25.405472328834968]
["ODInsgesamtMännlich55 und älterAusländerInsgesamt",14200,2877,"20,3",20.260563380281692]
["ODInsgesamtMännlich55 und älterAusländerKeine Berufsausbildung",10505,2098,"20,0",19.971442170395051]
["ODInsgesamtMännlich55 und älterAusländerBetriebliche/schulische Ausbildung",2293,507,"22,1",22.110771914522459]
["ODInsgesamtMännlich55 und älterAusländerAkademische Ausbildung",1402,272,"19,4",19.400855920114125]
["ODInsgesamtWeiblichInsgesamtInsgesamtInsgesamt",505224,70023,"13,9",13.859792883948508]
["ODInsgesamtWeiblichInsgesamtInsgesamtKeine Berufsausbildung",235815,34629,"14,7",14.684816487500797]
["ODInsgesamtWeiblichInsgesamtInsgesamtBetriebliche/schulische Ausbildung",189716,27845,"14,7",14.677201712032723]
["ODInsgesamtWeiblichInsgesamtInsgesamtAkademische Ausbildung",79693,7549,"9,5",9.4726011067471418]
["ODInsgesamtWeiblichInsgesamtDeutscheInsgesamt",330734,46324,"14,0",14.006422079374966]
["ODInsgesamtWeiblichInsgesamtDeutscheKeine Berufsausbildung",108215,17334,"16,0",16.018112091669362]
["ODInsgesamtWeiblichInsgesamtDeutscheBetriebliche/schulische Ausbildung",172264,24770,"14,4",14.379092555612317]
["ODInsgesamtWeiblichInsgesamtDeutscheAkademische Ausbildung",50255,4220,"8,4",8.3971744105064161]
["ODInsgesamtWeiblichInsgesamtAusländerInsgesamt",174489,23699,"13,6",13.581944993667221]
["ODInsgesamtWeiblichInsgesamtAusländerKeine Berufsausbildung",127600,17295,"13,6",13.554075235109716]
["ODInsgesamtWeiblichInsgesamtAusländerBetriebliche/schulische Ausbildung",17452,3075,"17,6",17.619757047902819]
["ODInsgesamtWeiblichInsgesamtAusländerAkademische Ausbildung",29437,3329,"11,3",11.308896966402827]
["ODInsgesamtWeiblich15 bis unter 25 JahreInsgesamtInsgesamt",69600,5424,"7,8",7.7931034482758621]
["ODInsgesamtWeiblich15 bis unter 25 JahreInsgesamtKeine Berufsausbildung",51532,4527,"8,8",8.7848327252969032]
["ODInsgesamtWeiblich15 bis unter 25 JahreInsgesamtBetriebliche/schulische Ausbildung",15627,799,"5,1",5.1129455429704995]
["ODInsgesamtWeiblich15 bis unter 25 JahreInsgesamtAkademische Ausbildung",2441,98,"4,0",4.0147480540761986]
["ODInsgesamtWeiblich15 bis unter 25 JahreDeutscheInsgesamt",48396,4035,"8,3",8.3374659062732466]
["ODInsgesamtWeiblich15 bis unter 25 JahreDeutscheKeine Berufsausbildung",32733,3307,"10,1",10.102954205236307]
["ODInsgesamtWeiblich15 bis unter 25 JahreDeutscheBetriebliche/schulische Ausbildung",14271,699,"4,9",4.8980449863359263]
["ODInsgesamtWeiblich15 bis unter 25 JahreDeutscheAkademische Ausbildung",1392,29,"2,1",2.083333333333333]
["ODInsgesamtWeiblich15 bis unter 25 JahreAusländerInsgesamt",21204,1389,"6,6",6.5506508205998859]
["ODInsgesamtWeiblich15 bis unter 25 JahreAusländerKeine Berufsausbildung",18799,1220,"6,5",6.4897068993031546]
["ODInsgesamtWeiblich15 bis unter 25 JahreAusländerBetriebliche/schulische Ausbildung",1356,100,"7,4",7.3746312684365778]
["ODInsgesamtWeiblich15 bis unter 25 JahreAusländerAkademische Ausbildung",1049,69,"6,6",6.57769304099142]
["ODInsgesamtWeiblich25 bis unter 35 JahreInsgesamtInsgesamt",127776,15527,"12,2",12.151734284998748]
["ODInsgesamtWeiblich25 bis unter 35 JahreInsgesamtKeine Berufsausbildung",60137,9545,"15,9",15.872092056471057]
["ODInsgesamtWeiblich25 bis unter 35 JahreInsgesamtBetriebliche/schulische Ausbildung",36949,4051,"11,0",10.963760859563182]
["ODInsgesamtWeiblich25 bis unter 35 JahreInsgesamtAkademische Ausbildung",30690,1931,"6,3",6.291951775822743]
["ODInsgesamtWeiblich25 bis unter 35 JahreDeutscheInsgesamt",77830,9280,"11,9",11.923422844661442]
["ODInsgesamtWeiblich25 bis unter 35 JahreDeutscheKeine Berufsausbildung",26374,5026,"19,1",19.056646697505119]
["ODInsgesamtWeiblich25 bis unter 35 JahreDeutscheBetriebliche/schulische Ausbildung",32553,3405,"10,5",10.459865450188923]
["ODInsgesamtWeiblich25 bis unter 35 JahreDeutscheAkademische Ausbildung",18903,849,"4,5",4.4913505792731314]
["ODInsgesamtWeiblich25 bis unter 35 JahreAusländerInsgesamt",49946,6247,"12,5",12.50750810875746]
["ODInsgesamtWeiblich25 bis unter 35 JahreAusländerKeine Berufsausbildung",33763,4519,"13,4",13.384474128483841]
["ODInsgesamtWeiblich25 bis unter 35 JahreAusländerBetriebliche/schulische Ausbildung",4396,646,"14,7",14.695177434030937]
["ODInsgesamtWeiblich25 bis unter 35 JahreAusländerAkademische Ausbildung",11787,1082,"9,2",9.179604649189784]
["ODInsgesamtWeiblich35 bis unter 45 JahreInsgesamtInsgesamt",132502,18003,"13,6",13.586964725060755]
["ODInsgesamtWeiblich35 bis unter 45 JahreInsgesamtKeine Berufsausbildung",58552,9575,"16,4",16.352985380516465]
["ODInsgesamtWeiblich35 bis unter 45 JahreInsgesamtBetriebliche/schulische Ausbildung",47366,6084,"12,8",12.844656504665794]
["ODInsgesamtWeiblich35 bis unter 45 JahreInsgesamtAkademische Ausbildung",26584,2344,"8,8",8.8173337345771881]
["ODInsgesamtWeiblich35 bis unter 45 JahreDeutscheInsgesamt",79016,10330,"13,1",13.073301609800547]
["ODInsgesamtWeiblich35 bis unter 45 JahreDeutscheKeine Berufsausbildung",21344,4082,"19,1",19.124812593703147]
["ODInsgesamtWeiblich35 bis unter 45 JahreDeutscheBetriebliche/schulische Ausbildung",42003,5159,"12,3",12.282456015046545]
["ODInsgesamtWeiblich35 bis unter 45 JahreDeutscheAkademische Ausbildung",15669,1089,"7,0",6.9500287191269381]
["ODInsgesamtWeiblich35 bis unter 45 JahreAusländerInsgesamt",53486,7673,"14,3",14.345810118535693]
["ODInsgesamtWeiblich35 bis unter 45 JahreAusländerKeine Berufsausbildung",37208,5493,"14,8",14.762954203397118]
["ODInsgesamtWeiblich35 bis unter 45 JahreAusländerBetriebliche/schulische Ausbildung",5363,925,"17,2",17.247809062092113]
["ODInsgesamtWeiblich35 bis unter 45 JahreAusländerAkademische Ausbildung",10915,1255,"11,5",11.497938616582685]
["ODInsgesamtWeiblich45 bis unter 55 JahreInsgesamtInsgesamt",88329,12457,"14,1",14.102955994067635]
["ODInsgesamtWeiblich45 bis unter 55 JahreInsgesamtKeine Berufsausbildung",38048,6002,"15,8",15.774810765349031]
["ODInsgesamtWeiblich45 bis unter 55 JahreInsgesamtBetriebliche/schulische Ausbildung",39464,5308,"13,5",13.45023312385972]
["ODInsgesamtWeiblich45 bis unter 55 JahreInsgesamtAkademische Ausbildung",10817,1147,"10,6",10.603679393547194]
["ODInsgesamtWeiblich45 bis unter 55 JahreDeutscheInsgesamt",55630,7268,"13,1",13.064893043321948]
["ODInsgesamtWeiblich45 bis unter 55 JahreDeutscheKeine Berufsausbildung",13663,2197,"16,1",16.079923882017127]
["ODInsgesamtWeiblich45 bis unter 55 JahreDeutscheBetriebliche/schulische Ausbildung",35195,4498,"12,8",12.780224463702231]
["ODInsgesamtWeiblich45 bis unter 55 JahreDeutscheAkademische Ausbildung",6772,573,"8,5",8.461311281748376]
["ODInsgesamtWeiblich45 bis unter 55 JahreAusländerInsgesamt",32698,5189,"15,9",15.869472138968742]
["ODInsgesamtWeiblich45 bis unter 55 JahreAusländerKeine Berufsausbildung",24385,3805,"15,6",15.603854828788188]
["ODInsgesamtWeiblich45 bis unter 55 JahreAusländerBetriebliche/schulische Ausbildung",4269,810,"19,0",18.973998594518623]
["ODInsgesamtWeiblich45 bis unter 55 JahreAusländerAkademische Ausbildung",4044,574,"14,2",14.193867457962414]
["ODInsgesamtWeiblich55 und älterInsgesamtInsgesamt",87017,18612,"21,4",21.388924003355665]
["ODInsgesamtWeiblich55 und älterInsgesamtKeine Berufsausbildung",27546,4980,"18,1",18.078849923763887]
["ODInsgesamtWeiblich55 und älterInsgesamtBetriebliche/schulische Ausbildung",50310,11603,"23,1",23.063009342079109]
["ODInsgesamtWeiblich55 und älterInsgesamtAkademische Ausbildung",9161,2029,"22,1",22.148237092020523]
["ODInsgesamtWeiblich55 und älterDeutscheInsgesamt",69862,15411,"22,1",22.059202427643068]
["ODInsgesamtWeiblich55 und älterDeutscheKeine Berufsausbildung",14101,2722,"19,3",19.303595489681584]
["ODInsgesamtWeiblich55 und älterDeutscheBetriebliche/schulische Ausbildung",48242,11009,"22,8",22.820363998175864]
["ODInsgesamtWeiblich55 und älterDeutscheAkademische Ausbildung",7519,1680,"22,3",22.343396728288337]
["ODInsgesamtWeiblich55 und älterAusländerInsgesamt",17155,3201,"18,7",18.659283007869426]
["ODInsgesamtWeiblich55 und älterAusländerKeine Berufsausbildung",13445,2258,"16,8",16.794347341018966]
["ODInsgesamtWeiblich55 und älterAusländerBetriebliche/schulische Ausbildung",2068,594,"28,7",28.723404255319153]
["ODInsgesamtWeiblich55 und älterAusländerAkademische Ausbildung",1642,349,"21,3",21.254567600487213]
["ODIIIInsgesamtInsgesamtInsgesamtInsgesamt",503538,53298,"10,6",10.584702644090417]
["ODIIIInsgesamtInsgesamtInsgesamtKeine Berufsausbildung",135464,14233,"10,5",10.506850528553711]
["ODIIIInsgesamtInsgesamtInsgesamtBetriebliche/schulische Ausbildung",264826,30470,"11,5",11.505667872489861]
["ODIIIInsgesamtInsgesamtInsgesamtAkademische Ausbildung",103248,8595,"8,3",8.3246164574616461]
["ODIIIInsgesamtInsgesamtDeutscheInsgesamt",420290,45334,"10,8",10.786361797806276]
["ODIIIInsgesamtInsgesamtDeutscheKeine Berufsausbildung",92552,9737,"10,5",10.52057221886075]
["ODIIIInsgesamtInsgesamtDeutscheBetriebliche/schulische Ausbildung",250168,29012,"11,6",11.597006811422723]
["ODIIIInsgesamtInsgesamtDeutscheAkademische Ausbildung",77570,6585,"8,5",8.4891066133814608]
["ODIIIInsgesamtInsgesamtAusländerInsgesamt",83248,7964,"9,6",9.5665961945031714]
["ODIIIInsgesamtInsgesamtAusländerKeine Berufsausbildung",42912,4496,"10,5",10.477255779269203]
["ODIIIInsgesamtInsgesamtAusländerBetriebliche/schulische Ausbildung",14658,1458,"9,9",9.946786737617682]
["ODIIIInsgesamtInsgesamtAusländerAkademische Ausbildung",25678,2010,"7,8",7.8277124386634478]
["ODIIIInsgesamt15 bis unter 25 JahreInsgesamtInsgesamt",69011,3156,"4,6",4.5731839851617853]
["ODIIIInsgesamt15 bis unter 25 JahreInsgesamtKeine Berufsausbildung",37859,2046,"5,4",5.4042631870889357]
["ODIIIInsgesamt15 bis unter 25 JahreInsgesamtBetriebliche/schulische Ausbildung",29149,1082,"3,7",3.7119626745342895]
["ODIIIInsgesamt15 bis unter 25 JahreInsgesamtAkademische Ausbildung",2003,28,"1,4",1.3979031452820767]
["ODIIIInsgesamt15 bis unter 25 JahreDeutscheInsgesamt",60317,2718,"4,5",4.5061922840990105]
["ODIIIInsgesamt15 bis unter 25 JahreDeutscheKeine Berufsausbildung",31032,1679,"5,4",5.4105439546274816]
["ODIIIInsgesamt15 bis unter 25 JahreDeutscheBetriebliche/schulische Ausbildung",27688,1020,"3,7",3.6839063854377345]
["ODIIIInsgesamt15 bis unter 25 JahreDeutscheAkademische Ausbildung",1597,19,"1,2",1.1897307451471508]
["ODIIIInsgesamt15 bis unter 25 JahreAusländerInsgesamt",8694,438,"5,0",5.0379572118702551]
["ODIIIInsgesamt15 bis unter 25 JahreAusländerKeine Berufsausbildung",6827,367,"5,4",5.3757140764611107]
["ODIIIInsgesamt15 bis unter 25 JahreAusländerBetriebliche/schulische Ausbildung",1461,62,"4,2",4.2436687200547576]
["ODIIIInsgesamt15 bis unter 25 JahreAusländerAkademische Ausbildung",406,9,"2,2",2.2167487684729066]
["ODIIIInsgesamt25 bis unter 35 JahreInsgesamtInsgesamt",131470,9337,"7,1",7.1020004563778816]
["ODIIIInsgesamt25 bis unter 35 JahreInsgesamtKeine Berufsausbildung",37072,3741,"10,1",10.091173931808372]
["ODIIIInsgesamt25 bis unter 35 JahreInsgesamtBetriebliche/schulische Ausbildung",54293,3653,"6,7",6.7283075166227695]
["ODIIIInsgesamt25 bis unter 35 JahreInsgesamtAkademische Ausbildung",40105,1943,"4,8",4.8447824460790425]
["ODIIIInsgesamt25 bis unter 35 JahreDeutscheInsgesamt",99035,6738,"6,8",6.8036552733881956]
["ODIIIInsgesamt25 bis unter 35 JahreDeutscheKeine Berufsausbildung",21501,2305,"10,7",10.720431607832195]
["ODIIIInsgesamt25 bis unter 35 JahreDeutscheBetriebliche/schulische Ausbildung",49747,3286,"6,6",6.6054234426196556]
["ODIIIInsgesamt25 bis unter 35 JahreDeutscheAkademische Ausbildung",27787,1147,"4,1",4.1278295605858855]
["ODIIIInsgesamt25 bis unter 35 JahreAusländerInsgesamt",32435,2599,"8,0",8.0129489748728222]
["ODIIIInsgesamt25 bis unter 35 JahreAusländerKeine Berufsausbildung",15571,1436,"9,2",9.2222721726286032]
["ODIIIInsgesamt25 bis unter 35 JahreAusländerBetriebliche/schulische Ausbildung",4546,367,"8,1",8.0730312362516496]
["ODIIIInsgesamt25 bis unter 35 JahreAusländerAkademische Ausbildung",12318,796,"6,5",6.4620880012989117]
["ODIIIInsgesamt35 bis unter 45 JahreInsgesamtInsgesamt",126053,10582,"8,4",8.3948815180915961]
["ODIIIInsgesamt35 bis unter 45 JahreInsgesamtKeine Berufsausbildung",28997,3337,"11,5",11.508087043487256]
["ODIIIInsgesamt35 bis unter 45 JahreInsgesamtBetriebliche/schulische Ausbildung",63462,5032,"7,9",7.9291544546342703]
["ODIIIInsgesamt35 bis unter 45 JahreInsgesamtAkademische Ausbildung",33594,2213,"6,6",6.5874858605703395]
["ODIIIInsgesamt35 bis unter 45 JahreDeutscheInsgesamt",102229,8237,"8,1",8.0574005419205896]
["ODIIIInsgesamt35 bis unter 45 JahreDeutscheKeine Berufsausbildung",18517,2166,"11,7",11.697359183453043]
["ODIIIInsgesamt35 bis unter 45 JahreDeutscheBetriebliche/schulische Ausbildung",59412,4630,"7,8",7.7930384434121054]
["ODIIIInsgesamt35 bis unter 45 JahreDeutscheAkademische Ausbildung",24300,1441,"5,9",5.9300411522633745]
["ODIIIInsgesamt35 bis unter 45 JahreAusländerInsgesamt",23824,2345,"9,8",9.8430154466084616]
["ODIIIInsgesamt35 bis unter 45 JahreAusländerKeine Berufsausbildung",10480,1171,"11,2",11.173664122137405]
["ODIIIInsgesamt35 bis unter 45 JahreAusländerBetriebliche/schulische Ausbildung",4050,402,"9,9",9.9259259259259256]
["ODIIIInsgesamt35 bis unter 45 JahreAusländerAkademische Ausbildung",9294,772,"8,3",8.3064342586615023]
["ODIIIInsgesamt45 bis unter 55 JahreInsgesamtInsgesamt",81823,8128,"9,9",9.9336372413624527]
["ODIIIInsgesamt45 bis unter 55 JahreInsgesamtKeine Berufsausbildung",17501,2145,"12,3",12.256442489000628]
["ODIIIInsgesamt45 bis unter 55 JahreInsgesamtBetriebliche/schulische Ausbildung",50939,4894,"9,6",9.6075698384342054]
["ODIIIInsgesamt45 bis unter 55 JahreInsgesamtAkademische Ausbildung",13383,1089,"8,1",8.1371889710827165]
["ODIIIInsgesamt45 bis unter 55 JahreDeutscheInsgesamt",69270,6632,"9,6",9.5741302151003325]
["ODIIIInsgesamt45 bis unter 55 JahreDeutscheKeine Berufsausbildung",10709,1261,"11,8",11.775142403585768]
["ODIIIInsgesamt45 bis unter 55 JahreDeutscheBetriebliche/schulische Ausbildung",47853,4551,"9,5",9.5103755250454522]
["ODIIIInsgesamt45 bis unter 55 JahreDeutscheAkademische Ausbildung",10708,820,"7,7",7.6578259245423981]
["ODIIIInsgesamt45 bis unter 55 JahreAusländerInsgesamt",12553,1496,"11,9",11.917469927507367]
["ODIIIInsgesamt45 bis unter 55 JahreAusländerKeine Berufsausbildung",6792,884,"13,0",13.015312131919906]
["ODIIIInsgesamt45 bis unter 55 JahreAusländerBetriebliche/schulische Ausbildung",3086,343,"11,1",11.114711600777706]
["ODIIIInsgesamt45 bis unter 55 JahreAusländerAkademische Ausbildung",2675,269,"10,1",10.05607476635514]
["ODIIIInsgesamt55 und älterInsgesamtInsgesamt",95181,22095,"23,2",23.213666593122579]
["ODIIIInsgesamt55 und älterInsgesamtKeine Berufsausbildung",14035,2964,"21,1",21.118631991449945]
["ODIIIInsgesamt55 und älterInsgesamtBetriebliche/schulische Ausbildung",66983,15809,"23,6",23.601510831106403]
["ODIIIInsgesamt55 und älterInsgesamtAkademische Ausbildung",14163,3322,"23,5",23.455482595495305]
["ODIIIInsgesamt55 und älterDeutscheInsgesamt",89439,21009,"23,5",23.489752792405998]
["ODIIIInsgesamt55 und älterDeutscheKeine Berufsausbildung",10793,2326,"21,6",21.551005281200776]
["ODIIIInsgesamt55 und älterDeutscheBetriebliche/schulische Ausbildung",65468,15525,"23,7",23.713875481151099]
["ODIIIInsgesamt55 und älterDeutscheAkademische Ausbildung",13178,3158,"24,0",23.964182728790409]
["ODIIIInsgesamt55 und älterAusländerInsgesamt",5742,1086,"18,9",18.913270637408569]
["ODIIIInsgesamt55 und älterAusländerKeine Berufsausbildung",3242,638,"19,7",19.679210363972857]
["ODIIIInsgesamt55 und älterAusländerBetriebliche/schulische Ausbildung",1515,284,"18,7",18.745874587458747]
["ODIIIInsgesamt55 und älterAusländerAkademische Ausbildung",985,164,"16,6",16.649746192893399]
["ODIIIMännlichInsgesamtInsgesamtInsgesamt",279434,31137,"11,1",11.142881682257705]
["ODIIIMännlichInsgesamtInsgesamtKeine Berufsausbildung",86673,9342,"10,8",10.778443113772456]
["ODIIIMännlichInsgesamtInsgesamtBetriebliche/schulische Ausbildung",147106,17512,"11,9",11.904341087379169]
["ODIIIMännlichInsgesamtInsgesamtAkademische Ausbildung",45655,4283,"9,4",9.3812287810754569]
["ODIIIMännlichInsgesamtDeutscheInsgesamt",230870,26418,"11,4",11.44280330922164]
["ODIIIMännlichInsgesamtDeutscheKeine Berufsausbildung",57551,6332,"11,0",11.002415249083422]
["ODIIIMännlichInsgesamtDeutscheBetriebliche/schulische Ausbildung",138837,16693,"12,0",12.023451961652873]
["ODIIIMännlichInsgesamtDeutscheAkademische Ausbildung",34482,3393,"9,8",9.8399164781625199]
["ODIIIMännlichInsgesamtAusländerInsgesamt",48564,4719,"9,7",9.7170743760810474]
["ODIIIMännlichInsgesamtAusländerKeine Berufsausbildung",29122,3010,"10,3",10.335828583201703]
["ODIIIMännlichInsgesamtAusländerBetriebliche/schulische Ausbildung",8269,819,"9,9",9.9044624501148864]
["ODIIIMännlichInsgesamtAusländerAkademische Ausbildung",11173,890,"8,0",7.9656314329186433]
["ODIIIMännlich15 bis unter 25 JahreInsgesamtInsgesamt",42229,2067,"4,9",4.894740581117242]
["ODIIIMännlich15 bis unter 25 JahreInsgesamtKeine Berufsausbildung",24543,1393,"5,7",5.675752760461231]
["ODIIIMännlich15 bis unter 25 JahreInsgesamtBetriebliche/schulische Ausbildung",17021,663,"3,9",3.8951882968098235]
["ODIIIMännlich15 bis unter 25 JahreInsgesamtAkademische Ausbildung",665,11,"1,7",1.6541353383458646]
["ODIIIMännlich15 bis unter 25 JahreDeutscheInsgesamt",36213,1754,"4,8",4.8435644657995747]
["ODIIIMännlich15 bis unter 25 JahreDeutscheKeine Berufsausbildung",19510,1116,"5,7",5.7201435161455665]
["ODIIIMännlich15 bis unter 25 JahreDeutscheBetriebliche/schulische Ausbildung",16160,629,"3,9",3.8923267326732671]
["ODIIIMännlich15 bis unter 25 JahreDeutscheAkademische Ausbildung",543,9,"1,7",1.6574585635359116]
["ODIIIMännlich15 bis unter 25 JahreAusländerInsgesamt",6016,313,"5,2",5.2027925531914896]
["ODIIIMännlich15 bis unter 25 JahreAusländerKeine Berufsausbildung",5033,277,"5,5",5.5036757401152396]
["ODIIIMännlich15 bis unter 25 JahreAusländerBetriebliche/schulische Ausbildung",861,34,"3,9",3.9488966318234611]
["ODIIIMännlich15 bis unter 25 JahreAusländerAkademische Ausbildung","*","*","k.A.",{"$error":"#N/A"}]
["ODIIIMännlich25 bis unter 35 JahreInsgesamtInsgesamt",71635,5690,"7,9",7.9430446011028124]
["ODIIIMännlich25 bis unter 35 JahreInsgesamtKeine Berufsausbildung",24962,2644,"10,6",10.592099991987821]
["ODIIIMännlich25 bis unter 35 JahreInsgesamtBetriebliche/schulische Ausbildung",29915,2146,"7,2",7.173658699649005]
["ODIIIMännlich25 bis unter 35 JahreInsgesamtAkademische Ausbildung",16758,900,"5,4",5.3705692803437159]
["ODIIIMännlich25 bis unter 35 JahreDeutscheInsgesamt",52653,4127,"7,8",7.8381098892750645]
["ODIIIMännlich25 bis unter 35 JahreDeutscheKeine Berufsausbildung",13796,1610,"11,7",11.670049289649173]
["ODIIIMännlich25 bis unter 35 JahreDeutscheBetriebliche/schulische Ausbildung",27333,1960,"7,2",7.1708191563311745]
["ODIIIMännlich25 bis unter 35 JahreDeutscheAkademische Ausbildung",11524,557,"4,8",4.8333911836167998]
["ODIIIMännlich25 bis unter 35 JahreAusländerInsgesamt",18982,1563,"8,2",8.234116531450848]
["ODIIIMännlich25 bis unter 35 JahreAusländerKeine Berufsausbildung",11166,1034,"9,3",9.2602543435428988]
["ODIIIMännlich25 bis unter 35 JahreAusländerBetriebliche/schulische Ausbildung",2582,186,"7,2",7.203718048024788]
["ODIIIMännlich25 bis unter 35 JahreAusländerAkademische Ausbildung",5234,343,"6,6",6.5533053114252962]
["ODIIIMännlich35 bis unter 45 JahreInsgesamtInsgesamt",68389,6301,"9,2",9.2134700024857796]
["ODIIIMännlich35 bis unter 45 JahreInsgesamtKeine Berufsausbildung",18748,2296,"12,2",12.246639641561767]
["ODIIIMännlich35 bis unter 45 JahreInsgesamtBetriebliche/schulische Ausbildung",34796,3001,"8,6",8.6245545464995974]
["ODIIIMännlich35 bis unter 45 JahreInsgesamtAkademische Ausbildung",14845,1004,"6,8",6.7632199393735268]
["ODIIIMännlich35 bis unter 45 JahreDeutscheInsgesamt",55166,4963,"9,0",8.996483341188414]
["ODIIIMännlich35 bis unter 45 JahreDeutscheKeine Berufsausbildung",11912,1518,"12,7",12.743451981195433]
["ODIIIMännlich35 bis unter 45 JahreDeutscheBetriebliche/schulische Ausbildung",32578,2782,"8,5",8.5395051875498798]
["ODIIIMännlich35 bis unter 45 JahreDeutscheAkademische Ausbildung",10676,663,"6,2",6.2101910828025479]
["ODIIIMännlich35 bis unter 45 JahreAusländerInsgesamt",13223,1338,"10,1",10.118732511532935]
["ODIIIMännlich35 bis unter 45 JahreAusländerKeine Berufsausbildung",6836,778,"11,4",11.380924517261557]
["ODIIIMännlich35 bis unter 45 JahreAusländerBetriebliche/schulische Ausbildung",2218,219,"9,9",9.8737601442741205]
["ODIIIMännlich35 bis unter 45 JahreAusländerAkademische Ausbildung",4169,341,"8,2",8.1794195250659634]
["ODIIIMännlich45 bis unter 55 JahreInsgesamtInsgesamt",44621,4785,"10,7",10.723650299186483]
["ODIIIMännlich45 bis unter 55 JahreInsgesamtKeine Berufsausbildung",10471,1313,"12,5",12.539394518193106]
["ODIIIMännlich45 bis unter 55 JahreInsgesamtBetriebliche/schulische Ausbildung",28076,2909,"10,4",10.361162558769054]
["ODIIIMännlich45 bis unter 55 JahreInsgesamtAkademische Ausbildung",6074,563,"9,3",9.2690154757984846]
["ODIIIMännlich45 bis unter 55 JahreDeutscheInsgesamt",37808,3945,"10,4",10.434299619128227]
["ODIIIMännlich45 bis unter 55 JahreDeutscheKeine Berufsausbildung",6402,793,"12,4",12.386754139331458]
["ODIIIMännlich45 bis unter 55 JahreDeutscheBetriebliche/schulische Ausbildung",26439,2714,"10,3",10.265138620976588]
["ODIIIMännlich45 bis unter 55 JahreDeutscheAkademische Ausbildung",4967,438,"8,8",8.8182001207972629]
["ODIIIMännlich45 bis unter 55 JahreAusländerInsgesamt",6813,840,"12,3",12.329370321444298]
["ODIIIMännlich45 bis unter 55 JahreAusländerKeine Berufsausbildung",4069,520,"12,8",12.779552715654951]
["ODIIIMännlich45 bis unter 55 JahreAusländerBetriebliche/schulische Ausbildung",1637,195,"11,9",11.912034208918755]
["ODIIIMännlich45 bis unter 55 JahreAusländerAkademische Ausbildung",1107,125,"11,3",11.29177958446251]
["ODIIIMännlich55 und älterInsgesamtInsgesamt",52560,12294,"23,4",23.390410958904109]
["ODIIIMännlich55 und älterInsgesamtKeine Berufsausbildung",7949,1696,"21,3",21.336017109070323]
["ODIIIMännlich55 und älterInsgesamtBetriebliche/schulische Ausbildung",37298,8793,"23,6",23.574990616118825]
["ODIIIMännlich55 und älterInsgesamtAkademische Ausbildung",7313,1805,"24,7",24.682073020648161]
["ODIIIMännlich55 und älterDeutscheInsgesamt",49030,11629,"23,7",23.718131756067713]
["ODIIIMännlich55 und älterDeutscheKeine Berufsausbildung",5931,1295,"21,8",21.834429269937615]
["ODIIIMännlich55 und älterDeutscheBetriebliche/schulische Ausbildung",36327,8608,"23,7",23.695873592644588]
["ODIIIMännlich55 und älterDeutscheAkademische Ausbildung",6772,1726,"25,5",25.487300649734202]
["ODIIIMännlich55 und älterAusländerInsgesamt",3530,665,"18,8",18.838526912181301]
["ODIIIMännlich55 und älterAusländerKeine Berufsausbildung",2018,401,"19,9",19.871159563924678]
["ODIIIMännlich55 und älterAusländerBetriebliche/schulische Ausbildung",971,185,"19,1",19.052523171987641]
["ODIIIMännlich55 und älterAusländerAkademische Ausbildung",541,79,"14,6",14.602587800369685]
["ODIIIWeiblichInsgesamtInsgesamtInsgesamt",224087,22161,"9,9",9.8894625748035363]
["ODIIIWeiblichInsgesamtInsgesamtKeine Berufsausbildung",48785,4891,"10,0",10.025622629906733]
["ODIIIWeiblichInsgesamtInsgesamtBetriebliche/schulische Ausbildung",117718,12958,"11,0",11.00766237958511]
["ODIIIWeiblichInsgesamtInsgesamtAkademische Ausbildung",57584,4312,"7,5",7.4881911642122807]
["ODIIIWeiblichInsgesamtDeutscheInsgesamt",189408,18916,"10,0",9.9869065720560908]
["ODIIIWeiblichInsgesamtDeutscheKeine Berufsausbildung",34995,3405,"9,7",9.7299614230604377]
["ODIIIWeiblichInsgesamtDeutscheBetriebliche/schulische Ausbildung",111329,12319,"11,1",11.065400749130955]
["ODIIIWeiblichInsgesamtDeutscheAkademische Ausbildung",43084,3192,"7,4",7.4087828428186802]
["ODIIIWeiblichInsgesamtAusländerInsgesamt",34679,3245,"9,4",9.3572479021886448]
["ODIIIWeiblichInsgesamtAusländerKeine Berufsausbildung",13790,1486,"10,8",10.775924583031182]
["ODIIIWeiblichInsgesamtAusländerBetriebliche/schulische Ausbildung",6389,639,"10,0",10.001565190170606]
["ODIIIWeiblichInsgesamtAusländerAkademische Ausbildung",14500,1120,"7,7",7.7241379310344831]
["ODIIIWeiblich15 bis unter 25 JahreInsgesamtInsgesamt",26778,1089,"4,1",4.0667712301142727]
["ODIIIWeiblich15 bis unter 25 JahreInsgesamtKeine Berufsausbildung",13314,653,"4,9",4.9046116869460716]
["ODIIIWeiblich15 bis unter 25 JahreInsgesamtBetriebliche/schulische Ausbildung",12127,419,"3,5",3.4551001896594373]
["ODIIIWeiblich15 bis unter 25 JahreInsgesamtAkademische Ausbildung",1337,17,"1,3",1.2715033657442034]
["ODIIIWeiblich15 bis unter 25 JahreDeutscheInsgesamt",24100,964,"4,0",4]
["ODIIIWeiblich15 bis unter 25 JahreDeutscheKeine Berufsausbildung",11520,563,"4,9",4.8871527777777777]
["ODIIIWeiblich15 bis unter 25 JahreDeutscheBetriebliche/schulische Ausbildung",11527,391,"3,4",3.3920360891819206]
["ODIIIWeiblich15 bis unter 25 JahreDeutscheAkademische Ausbildung",1053,10,"0,9",0.94966761633428298]
["ODIIIWeiblich15 bis unter 25 JahreAusländerInsgesamt",2678,125,"4,7",4.6676624346527262]
["ODIIIWeiblich15 bis unter 25 JahreAusländerKeine Berufsausbildung",1794,90,"5,0",5.0167224080267561]
["ODIIIWeiblich15 bis unter 25 JahreAusländerBetriebliche/schulische Ausbildung",600,28,"4,7",4.666666666666667]
["ODIIIWeiblich15 bis unter 25 JahreAusländerAkademische Ausbildung","*","*","2,5",2.464788732394366]
["ODIIIWeiblich25 bis unter 35 JahreInsgesamtInsgesamt",59830,3647,"6,1",6.0956042119338125]
["ODIIIWeiblich25 bis unter 35 JahreInsgesamtKeine Berufsausbildung",12109,1097,"9,1",9.0593773226525727]
["ODIIIWeiblich25 bis unter 35 JahreInsgesamtBetriebliche/schulische Ausbildung",24378,1507,"6,2",6.1818032652391501]
["ODIIIWeiblich25 bis unter 35 JahreInsgesamtAkademische Ausbildung",23343,1043,"4,5",4.468148909737395]
["ODIIIWeiblich25 bis unter 35 JahreDeutscheInsgesamt",46378,2611,"5,6",5.6298244857475526]
["ODIIIWeiblich25 bis unter 35 JahreDeutscheKeine Berufsausbildung",7704,695,"9,0",9.0212876427829691]
["ODIIIWeiblich25 bis unter 35 JahreDeutscheBetriebliche/schulische Ausbildung",22414,1326,"5,9",5.9159453912733113]
["ODIIIWeiblich25 bis unter 35 JahreDeutscheAkademische Ausbildung",16260,590,"3,6",3.6285362853628538]
["ODIIIWeiblich25 bis unter 35 JahreAusländerInsgesamt",13452,1036,"7,7",7.7014570324115379]
["ODIIIWeiblich25 bis unter 35 JahreAusländerKeine Berufsausbildung",4405,402,"9,1",9.1259931895573221]
["ODIIIWeiblich25 bis unter 35 JahreAusländerBetriebliche/schulische Ausbildung",1964,181,"9,2",9.2158859470468446]
["ODIIIWeiblich25 bis unter 35 JahreAusländerAkademische Ausbildung",7083,453,"6,4",6.3955950868276155]
["ODIIIWeiblich35 bis unter 45 JahreInsgesamtInsgesamt",57661,4281,"7,4",7.4244289901319789]
["ODIIIWeiblich35 bis unter 45 JahreInsgesamtKeine Berufsausbildung",10249,1041,"10,2",10.157088496438677]
["ODIIIWeiblich35 bis unter 45 JahreInsgesamtBetriebliche/schulische Ausbildung",28666,2031,"7,1",7.085048489499755]
["ODIIIWeiblich35 bis unter 45 JahreInsgesamtAkademische Ausbildung",18746,1209,"6,4",6.4493758668515948]
["ODIIIWeiblich35 bis unter 45 JahreDeutscheInsgesamt",47063,3274,"7,0",6.956632598856852]
["ODIIIWeiblich35 bis unter 45 JahreDeutscheKeine Berufsausbildung",6605,648,"9,8",9.8107494322482971]
["ODIIIWeiblich35 bis unter 45 JahreDeutscheBetriebliche/schulische Ausbildung",26834,1848,"6,9",6.8867854214802113]
["ODIIIWeiblich35 bis unter 45 JahreDeutscheAkademische Ausbildung",13624,778,"5,7",5.7105108631826189]
["ODIIIWeiblich35 bis unter 45 JahreAusländerInsgesamt",10598,1007,"9,5",9.5017927910926581]
["ODIIIWeiblich35 bis unter 45 JahreAusländerKeine Berufsausbildung",3644,393,"10,8",10.784851811196488]
["ODIIIWeiblich35 bis unter 45 JahreAusländerBetriebliche/schulische Ausbildung",1832,183,"10,0",9.9890829694323138]
["ODIIIWeiblich35 bis unter 45 JahreAusländerAkademische Ausbildung",5122,431,"8,4",8.4146817649355725]
["ODIIIWeiblich45 bis unter 55 JahreInsgesamtInsgesamt",37199,3343,"9,0",8.9868007204494749]
["ODIIIWeiblich45 bis unter 55 JahreInsgesamtKeine Berufsausbildung",7029,832,"11,8",11.836676625409019]
["ODIIIWeiblich45 bis unter 55 JahreInsgesamtBetriebliche/schulische Ausbildung",22862,1985,"8,7",8.6825299623829935]
["ODIIIWeiblich45 bis unter 55 JahreInsgesamtAkademische Ausbildung",7308,526,"7,2",7.1975916803503015]
["ODIIIWeiblich45 bis unter 55 JahreDeutscheInsgesamt",31460,2687,"8,5",8.5410044500953592]
["ODIIIWeiblich45 bis unter 55 JahreDeutscheKeine Berufsausbildung",4306,468,"10,9",10.868555503947979]
["ODIIIWeiblich45 bis unter 55 JahreDeutscheBetriebliche/schulische Ausbildung",21413,1837,"8,6",8.5789006678186155]
["ODIIIWeiblich45 bis unter 55 JahreDeutscheAkademische Ausbildung",5741,382,"6,7",6.6538930499912912]
["ODIIIWeiblich45 bis unter 55 JahreAusländerInsgesamt",5739,656,"11,4",11.43056281582157]
["ODIIIWeiblich45 bis unter 55 JahreAusländerKeine Berufsausbildung",2723,364,"13,4",13.367609254498714]
["ODIIIWeiblich45 bis unter 55 JahreAusländerBetriebliche/schulische Ausbildung",1449,148,"10,2",10.213940648723257]
["ODIIIWeiblich45 bis unter 55 JahreAusländerAkademische Ausbildung",1567,144,"9,2",9.1895341416719845]
["ODIIIWeiblich55 und älterInsgesamtInsgesamt",42619,9801,"23,0",22.996785471268684]
["ODIIIWeiblich55 und älterInsgesamtKeine Berufsausbildung",6084,1268,"20,8",20.841551610782378]
["ODIIIWeiblich55 und älterInsgesamtBetriebliche/schulische Ausbildung",29685,7016,"23,6",23.63483240693953]
["ODIIIWeiblich55 und älterInsgesamtAkademische Ausbildung",6850,1517,"22,1",22.145985401459853]
["ODIIIWeiblich55 und älterDeutscheInsgesamt",40407,9380,"23,2",23.213799589180091]
["ODIIIWeiblich55 und älterDeutscheKeine Berufsausbildung",4860,1031,"21,2",21.213991769547324]
["ODIIIWeiblich55 und älterDeutscheBetriebliche/schulische Ausbildung",29141,6917,"23,7",23.73631652997495]
["ODIIIWeiblich55 und älterDeutscheAkademische Ausbildung",6406,1432,"22,4",22.354043084608179]
["ODIIIWeiblich55 und älterAusländerInsgesamt",2212,421,"19,0",19.032549728752262]
["ODIIIWeiblich55 und älterAusländerKeine Berufsausbildung",1224,237,"19,4",19.362745098039216]
["ODIIIWeiblich55 und älterAusländerBetriebliche/schulische Ausbildung",544,99,"18,2",18.198529411764707]
["ODIIIWeiblich55 und älterAusländerAkademische Ausbildung",444,85,"19,1",19.144144144144143]
["ODIIInsgesamtInsgesamtInsgesamtInsgesamt",545103,100686,"18,5",18.471004562440495]
["ODIIInsgesamtInsgesamtInsgesamtKeine Berufsausbildung",356570,61526,"17,3",17.254956950949325]
["ODIIInsgesamtInsgesamtInsgesamtBetriebliche/schulische Ausbildung",152164,33474,"22,0",21.998633053810362]
["ODIIInsgesamtInsgesamtInsgesamtAkademische Ausbildung",36369,5686,"15,6",15.634193956391432]
["ODIIInsgesamtInsgesamtDeutscheInsgesamt",305384,64044,"21,0",20.971629161973119]
["ODIIInsgesamtInsgesamtDeutscheKeine Berufsausbildung",158411,32398,"20,5",20.451862560049491]
["ODIIInsgesamtInsgesamtDeutscheBetriebliche/schulische Ausbildung",133495,29426,"22,0",22.042773137570695]
["ODIIInsgesamtInsgesamtDeutscheAkademische Ausbildung",13478,2220,"16,5",16.471286541029826]
["ODIIInsgesamtInsgesamtAusländerInsgesamt",239717,36642,"15,3",15.285524180596285]
["ODIIInsgesamtInsgesamtAusländerKeine Berufsausbildung",198158,29128,"14,7",14.699381301789479]
["ODIIInsgesamtInsgesamtAusländerBetriebliche/schulische Ausbildung",18669,4048,"21,7",21.683003910225509]
["ODIIInsgesamtInsgesamtAusländerAkademische Ausbildung",22890,3466,"15,1",15.141983398864134]
["ODIIInsgesamt15 bis unter 25 JahreInsgesamtInsgesamt",88700,9891,"11,2",11.151071025930101]
["ODIIInsgesamt15 bis unter 25 JahreInsgesamtKeine Berufsausbildung",81381,9081,"11,2",11.158624248903307]
["ODIIInsgesamt15 bis unter 25 JahreInsgesamtBetriebliche/schulische Ausbildung",5823,700,"12,0",12.021294865189764]
["ODIIInsgesamt15 bis unter 25 JahreInsgesamtAkademische Ausbildung",1496,110,"7,4",7.3529411764705888]
["ODIIInsgesamt15 bis unter 25 JahreDeutscheInsgesamt",50050,6875,"13,7",13.736263736263737]
["ODIIInsgesamt15 bis unter 25 JahreDeutscheKeine Berufsausbildung",44971,6277,"14,0",13.957883969669343]
["ODIIInsgesamt15 bis unter 25 JahreDeutscheBetriebliche/schulische Ausbildung",4574,568,"12,4",12.418014866637517]
["ODIIInsgesamt15 bis unter 25 JahreDeutscheAkademische Ausbildung",505,30,"5,9",5.9405940594059405]
["ODIIInsgesamt15 bis unter 25 JahreAusländerInsgesamt",38650,3016,"7,8",7.8033635187580854]
["ODIIInsgesamt15 bis unter 25 JahreAusländerKeine Berufsausbildung",36410,2804,"7,7",7.7011809942323541]
["ODIIInsgesamt15 bis unter 25 JahreAusländerBetriebliche/schulische Ausbildung",1249,132,"10,6",10.568454763811049]
["ODIIInsgesamt15 bis unter 25 JahreAusländerAkademische Ausbildung",991,80,"8,1",8.0726538849646818]
["ODIIInsgesamt25 bis unter 35 JahreInsgesamtInsgesamt",130034,24275,"18,7",18.668194472214957]
["ODIIInsgesamt25 bis unter 35 JahreInsgesamtKeine Berufsausbildung",93128,17573,"18,9",18.869727686624859]
["ODIIInsgesamt25 bis unter 35 JahreInsgesamtBetriebliche/schulische Ausbildung",24677,5192,"21,0",21.039834663857032]
["ODIIInsgesamt25 bis unter 35 JahreInsgesamtAkademische Ausbildung",12229,1510,"12,3",12.347698094692943]
["ODIIInsgesamt25 bis unter 35 JahreDeutscheInsgesamt",65547,14561,"22,2",22.214594108044608]
["ODIIInsgesamt25 bis unter 35 JahreDeutscheKeine Berufsausbildung",40314,9656,"24,0",23.951976980701492]
["ODIIInsgesamt25 bis unter 35 JahreDeutscheBetriebliche/schulische Ausbildung",20419,4370,"21,4",21.401635731426612]
["ODIIInsgesamt25 bis unter 35 JahreDeutscheAkademische Ausbildung",4814,535,"11,1",11.11341919401745]
["ODIIInsgesamt25 bis unter 35 JahreAusländerInsgesamt",64487,9714,"15,1",15.063501170778606]
["ODIIInsgesamt25 bis unter 35 JahreAusländerKeine Berufsausbildung",52814,7917,"15,0",14.990343469534592]
["ODIIInsgesamt25 bis unter 35 JahreAusländerBetriebliche/schulische Ausbildung",4258,822,"19,3",19.304837952090185]
["ODIIInsgesamt25 bis unter 35 JahreAusländerAkademische Ausbildung",7415,975,"13,1",13.149022252191504]
["ODIIInsgesamt35 bis unter 45 JahreInsgesamtInsgesamt",137304,27967,"20,4",20.368670978267204]
["ODIIInsgesamt35 bis unter 45 JahreInsgesamtKeine Berufsausbildung",86783,17106,"19,7",19.711233766982012]
["ODIIInsgesamt35 bis unter 45 JahreInsgesamtBetriebliche/schulische Ausbildung",38182,8960,"23,5",23.466554921167042]
["ODIIInsgesamt35 bis unter 45 JahreInsgesamtAkademische Ausbildung",12339,1901,"15,4",15.406434881270767]
["ODIIInsgesamt35 bis unter 45 JahreDeutscheInsgesamt",69799,16874,"24,2",24.175131448874627]
["ODIIInsgesamt35 bis unter 45 JahreDeutscheKeine Berufsausbildung",33550,8486,"25,3",25.293591654247393]
["ODIIInsgesamt35 bis unter 45 JahreDeutscheBetriebliche/schulische Ausbildung",32510,7752,"23,8",23.844970778222084]
["ODIIInsgesamt35 bis unter 45 JahreDeutscheAkademische Ausbildung",3739,636,"17,0",17.009895694035841]
["ODIIInsgesamt35 bis unter 45 JahreAusländerInsgesamt",67505,11093,"16,4",16.432856825420338]
["ODIIInsgesamt35 bis unter 45 JahreAusländerKeine Berufsausbildung",53233,8620,"16,2",16.192963011665697]
["ODIIInsgesamt35 bis unter 45 JahreAusländerBetriebliche/schulische Ausbildung",5672,1208,"21,3",21.297602256699577]
["ODIIInsgesamt35 bis unter 45 JahreAusländerAkademische Ausbildung",8600,1265,"14,7",14.709302325581394]
["ODIIInsgesamt45 bis unter 55 JahreInsgesamtInsgesamt",97592,19479,"20,0",19.959627838347405]
["ODIIInsgesamt45 bis unter 55 JahreInsgesamtKeine Berufsausbildung",54996,10253,"18,6",18.643174049021745]
["ODIIInsgesamt45 bis unter 55 JahreInsgesamtBetriebliche/schulische Ausbildung",36768,8092,"22,0",22.008268059181898]
["ODIIInsgesamt45 bis unter 55 JahreInsgesamtAkademische Ausbildung",5828,1134,"19,5",19.457789979409746]
["ODIIInsgesamt45 bis unter 55 JahreDeutscheInsgesamt",54128,11652,"21,5",21.526751404079221]
["ODIIInsgesamt45 bis unter 55 JahreDeutscheKeine Berufsausbildung",20002,4184,"20,9",20.917908209179082]
["ODIIInsgesamt45 bis unter 55 JahreDeutscheBetriebliche/schulische Ausbildung",32124,7023,"21,9",21.862159133358237]
["ODIIInsgesamt45 bis unter 55 JahreDeutscheAkademische Ausbildung",2002,445,"22,2",22.227772227772228]
["ODIIInsgesamt45 bis unter 55 JahreAusländerInsgesamt",43462,7827,"18,0",18.008835304403846]
["ODIIInsgesamt45 bis unter 55 JahreAusländerKeine Berufsausbildung",34993,6069,"17,3",17.343468693738746]
["ODIIInsgesamt45 bis unter 55 JahreAusländerBetriebliche/schulische Ausbildung",4644,1069,"23,0",23.018949181739877]
["ODIIInsgesamt45 bis unter 55 JahreAusländerAkademische Ausbildung",3825,689,"18,0",18.013071895424837]
["ODIIInsgesamt55 und älterInsgesamtInsgesamt",91473,19074,"20,9",20.852054704666951]
["ODIIInsgesamt55 und älterInsgesamtKeine Berufsausbildung",40282,7513,"18,7",18.651010376843256]
["ODIIInsgesamt55 und älterInsgesamtBetriebliche/schulische Ausbildung",46714,10530,"22,5",22.541422271695851]
["ODIIInsgesamt55 und älterInsgesamtAkademische Ausbildung",4477,1031,"23,0",23.028813937904847]
["ODIIInsgesamt55 und älterDeutscheInsgesamt",65860,14082,"21,4",21.381718797449135]
["ODIIInsgesamt55 und älterDeutscheKeine Berufsausbildung",19574,3795,"19,4",19.387963625217125]
["ODIIInsgesamt55 und älterDeutscheBetriebliche/schulische Ausbildung",43868,9713,"22,1",22.141424272818455]
["ODIIInsgesamt55 und älterDeutscheAkademische Ausbildung",2418,574,"23,7",23.738626964433415]
["ODIIInsgesamt55 und älterAusländerInsgesamt",25613,4992,"19,5",19.490102682231679]
["ODIIInsgesamt55 und älterAusländerKeine Berufsausbildung",20708,3718,"18,0",17.954413753138883]
["ODIIInsgesamt55 und älterAusländerBetriebliche/schulische Ausbildung",2846,817,"28,7",28.70695713281799]
["ODIIInsgesamt55 und älterAusländerAkademische Ausbildung",2059,457,"22,2",22.195240407965031]
["ODIIMännlichInsgesamtInsgesamtInsgesamt",263963,52824,"20,0",20.011895606581227]
["ODIIMännlichInsgesamtInsgesamtKeine Berufsausbildung",169538,31788,"18,7",18.74977881065012]
["ODIIMännlichInsgesamtInsgesamtBetriebliche/schulische Ausbildung",80165,18587,"23,2",23.185929021393374]
["ODIIMännlichInsgesamtInsgesamtAkademische Ausbildung",14260,2449,"17,2",17.173913043478262]
["ODIIMännlichInsgesamtDeutscheInsgesamt",164057,36636,"22,3",22.331262914718664]
["ODIIMännlichInsgesamtDeutscheKeine Berufsausbildung",85190,18469,"21,7",21.67977462143444]
["ODIIMännlichInsgesamtDeutscheBetriebliche/schulische Ausbildung",72560,16975,"23,4",23.394432194046306]
["ODIIMännlichInsgesamtDeutscheAkademische Ausbildung",6307,1192,"18,9",18.899635325828445]
["ODIIMännlichInsgesamtAusländerInsgesamt",99905,16188,"16,2",16.203393223562383]
["ODIIMännlichInsgesamtAusländerKeine Berufsausbildung",84347,13319,"15,8",15.790721661706996]
["ODIIMännlichInsgesamtAusländerBetriebliche/schulische Ausbildung",7605,1612,"21,2",21.196581196581196]
["ODIIMännlichInsgesamtAusländerAkademische Ausbildung",7953,1257,"15,8",15.805356469256884]
["ODIIMännlich15 bis unter 25 JahreInsgesamtInsgesamt",45877,5556,"12,1",12.11064367765983]
["ODIIMännlich15 bis unter 25 JahreInsgesamtKeine Berufsausbildung",43162,5207,"12,1",12.063852462814513]
["ODIIMännlich15 bis unter 25 JahreInsgesamtBetriebliche/schulische Ausbildung",2323,320,"13,8",13.775290572535514]
["ODIIMännlich15 bis unter 25 JahreInsgesamtAkademische Ausbildung",392,29,"7,4",7.3979591836734695]
["ODIIMännlich15 bis unter 25 JahreDeutscheInsgesamt",25753,3804,"14,8",14.771094629751873]
["ODIIMännlich15 bis unter 25 JahreDeutscheKeine Berufsausbildung",23757,3533,"14,9",14.871406322347097]
["ODIIMännlich15 bis unter 25 JahreDeutscheBetriebliche/schulische Ausbildung",1830,260,"14,2",14.207650273224044]
["ODIIMännlich15 bis unter 25 JahreDeutscheAkademische Ausbildung",166,11,"6,6",6.6265060240963862]
["ODIIMännlich15 bis unter 25 JahreAusländerInsgesamt",20124,1752,"8,7",8.7060226595110315]
["ODIIMännlich15 bis unter 25 JahreAusländerKeine Berufsausbildung",19405,1674,"8,6",8.6266426178819895]
["ODIIMännlich15 bis unter 25 JahreAusländerBetriebliche/schulische Ausbildung",493,60,"12,2",12.170385395537526]
["ODIIMännlich15 bis unter 25 JahreAusländerAkademische Ausbildung","*","*","8,0",7.9646017699115044]
["ODIIMännlich25 bis unter 35 JahreInsgesamtInsgesamt",62088,12395,"20,0",19.96360005153975]
["ODIIMännlich25 bis unter 35 JahreInsgesamtKeine Berufsausbildung",45100,9125,"20,2",20.232815964523283]
["ODIIMännlich25 bis unter 35 JahreInsgesamtBetriebliche/schulische Ausbildung",12106,2648,"21,9",21.873451181232447]
["ODIIMännlich25 bis unter 35 JahreInsgesamtAkademische Ausbildung",4882,622,"12,7",12.740680049160179]
["ODIIMännlich25 bis unter 35 JahreDeutscheInsgesamt",34095,7892,"23,1",23.147089015984747]
["ODIIMännlich25 bis unter 35 JahreDeutscheKeine Berufsausbildung",21644,5325,"24,6",24.602661245610793]
["ODIIMännlich25 bis unter 35 JahreDeutscheBetriebliche/schulische Ausbildung",10280,2291,"22,3",22.285992217898833]
["ODIIMännlich25 bis unter 35 JahreDeutscheAkademische Ausbildung",2171,276,"12,7",12.713035467526485]
["ODIIMännlich25 bis unter 35 JahreAusländerInsgesamt",27993,4503,"16,1",16.086164398242417]
["ODIIMännlich25 bis unter 35 JahreAusländerKeine Berufsausbildung",23456,3800,"16,2",16.200545702592088]
["ODIIMännlich25 bis unter 35 JahreAusländerBetriebliche/schulische Ausbildung",1826,357,"19,6",19.550930996714129]
["ODIIMännlich25 bis unter 35 JahreAusländerAkademische Ausbildung",2711,346,"12,8",12.762818148284765]
["ODIIMännlich35 bis unter 45 JahreInsgesamtInsgesamt",62461,14245,"22,8",22.806231088199034]
["ODIIMännlich35 bis unter 45 JahreInsgesamtKeine Berufsausbildung",38479,8572,"22,3",22.277086202863899]
["ODIIMännlich35 bis unter 45 JahreInsgesamtBetriebliche/schulische Ausbildung",19481,4907,"25,2",25.18864534674811]
["ODIIMännlich35 bis unter 45 JahreInsgesamtAkademische Ausbildung",4501,766,"17,0",17.018440346589646]
["ODIIMännlich35 bis unter 45 JahreDeutscheInsgesamt",37846,9818,"25,9",25.941975373883636]
["ODIIMännlich35 bis unter 45 JahreDeutscheKeine Berufsausbildung",18811,5052,"26,9",26.85662644197544]
["ODIIMännlich35 bis unter 45 JahreDeutscheBetriebliche/schulische Ausbildung",17341,4441,"25,6",25.609826422928322]
["ODIIMännlich35 bis unter 45 JahreDeutscheAkademische Ausbildung",1694,325,"19,2",19.185360094451003]
["ODIIMännlich35 bis unter 45 JahreAusländerInsgesamt",24615,4427,"18,0",17.984968515133048]
["ODIIMännlich35 bis unter 45 JahreAusländerKeine Berufsausbildung",19668,3520,"17,9",17.897091722595079]
["ODIIMännlich35 bis unter 45 JahreAusländerBetriebliche/schulische Ausbildung",2140,466,"21,8",21.77570093457944]
["ODIIMännlich35 bis unter 45 JahreAusländerAkademische Ausbildung",2807,441,"15,7",15.710723192019952]
["ODIIMännlich45 bis unter 55 JahreInsgesamtInsgesamt",46462,10365,"22,3",22.308553226292453]
["ODIIMännlich45 bis unter 55 JahreInsgesamtKeine Berufsausbildung",23977,5083,"21,2",21.199482837719479]
["ODIIMännlich45 bis unter 55 JahreInsgesamtBetriebliche/schulische Ausbildung",20166,4769,"23,6",23.648715660021818]
["ODIIMännlich45 bis unter 55 JahreInsgesamtAkademische Ausbildung",2319,513,"22,1",22.121604139715394]
["ODIIMännlich45 bis unter 55 JahreDeutscheInsgesamt",29958,7071,"23,6",23.603044261966755]
["ODIIMännlich45 bis unter 55 JahreDeutscheKeine Berufsausbildung",10645,2455,"23,1",23.062470643494599]
["ODIIMännlich45 bis unter 55 JahreDeutscheBetriebliche/schulische Ausbildung",18342,4362,"23,8",23.781485116126923]
["ODIIMännlich45 bis unter 55 JahreDeutscheAkademische Ausbildung",971,254,"26,2",26.158599382080329]
["ODIIMännlich45 bis unter 55 JahreAusländerInsgesamt",16503,3294,"20,0",19.9600072714052]
["ODIIMännlich45 bis unter 55 JahreAusländerKeine Berufsausbildung",13331,2628,"19,7",19.713449853724402]
["ODIIMännlich45 bis unter 55 JahreAusländerBetriebliche/schulische Ausbildung",1824,407,"22,3",22.313596491228072]
["ODIIMännlich45 bis unter 55 JahreAusländerAkademische Ausbildung",1348,259,"19,2",19.213649851632049]
["ODIIMännlich55 und älterInsgesamtInsgesamt",47075,10263,"21,8",21.801380775358471]
["ODIIMännlich55 und älterInsgesamtKeine Berufsausbildung",18820,3801,"20,2",20.196599362380447]
["ODIIMännlich55 und älterInsgesamtBetriebliche/schulische Ausbildung",26089,5943,"22,8",22.779715588945532]
["ODIIMännlich55 und älterInsgesamtAkademische Ausbildung",2166,519,"24,0",23.961218836565095]
["ODIIMännlich55 und älterDeutscheInsgesamt",36405,8051,"22,1",22.115094080483448]
["ODIIMännlich55 und älterDeutscheKeine Berufsausbildung",10333,2104,"20,4",20.361947159585796]
["ODIIMännlich55 und älterDeutscheBetriebliche/schulische Ausbildung",24767,5621,"22,7",22.695522267533409]
["ODIIMännlich55 und älterDeutscheAkademische Ausbildung",1305,326,"25,0",24.980842911877392]
["ODIIMännlich55 und älterAusländerInsgesamt",10670,2212,"20,7",20.731021555763824]
["ODIIMännlich55 und älterAusländerKeine Berufsausbildung",8487,1697,"20,0",19.995286909390835]
["ODIIMännlich55 und älterAusländerBetriebliche/schulische Ausbildung",1322,322,"24,4",24.357034795763994]
["ODIIMännlich55 und älterAusländerAkademische Ausbildung",861,193,"22,4",22.415795586527292]
["ODIIWeiblichInsgesamtInsgesamtInsgesamt",281137,47862,"17,0",17.024440041687861]
["ODIIWeiblichInsgesamtInsgesamtKeine Berufsausbildung",187030,29738,"15,9",15.900122974923809]
["ODIIWeiblichInsgesamtInsgesamtBetriebliche/schulische Ausbildung",71998,14887,"20,7",20.676963248979138]
["ODIIWeiblichInsgesamtInsgesamtAkademische Ausbildung",22109,3237,"14,6",14.641096386087114]
["ODIIWeiblichInsgesamtDeutscheInsgesamt",141326,27408,"19,4",19.393459094575665]
["ODIIWeiblichInsgesamtDeutscheKeine Berufsausbildung",73220,13929,"19,0",19.023490849494674]
["ODIIWeiblichInsgesamtDeutscheBetriebliche/schulische Ausbildung",60935,12451,"20,4",20.433248543529992]
["ODIIWeiblichInsgesamtDeutscheAkademische Ausbildung",7171,1028,"14,3",14.335518058848137]
["ODIIWeiblichInsgesamtAusländerInsgesamt",139810,20454,"14,6",14.629854802946857]
["ODIIWeiblichInsgesamtAusländerKeine Berufsausbildung",113810,15809,"13,9",13.890695018012478]
["ODIIWeiblichInsgesamtAusländerBetriebliche/schulische Ausbildung",11063,2436,"22,0",22.019343758474193]
["ODIIWeiblichInsgesamtAusländerAkademische Ausbildung",14937,2209,"14,8",14.788779540737766]
["ODIIWeiblich15 bis unter 25 JahreInsgesamtInsgesamt",42822,4335,"10,1",10.123301106907665]
["ODIIWeiblich15 bis unter 25 JahreInsgesamtKeine Berufsausbildung",38218,3874,"10,1",10.136584855303783]
["ODIIWeiblich15 bis unter 25 JahreInsgesamtBetriebliche/schulische Ausbildung",3500,380,"10,9",10.857142857142858]
["ODIIWeiblich15 bis unter 25 JahreInsgesamtAkademische Ausbildung",1104,81,"7,3",7.3369565217391308]
["ODIIWeiblich15 bis unter 25 JahreDeutscheInsgesamt",24296,3071,"12,6",12.639940730984526]
["ODIIWeiblich15 bis unter 25 JahreDeutscheKeine Berufsausbildung",21213,2744,"12,9",12.935464102201481]
["ODIIWeiblich15 bis unter 25 JahreDeutscheBetriebliche/schulische Ausbildung",2744,308,"11,2",11.224489795918368]
["ODIIWeiblich15 bis unter 25 JahreDeutscheAkademische Ausbildung",339,19,"5,6",5.6047197640117989]
["ODIIWeiblich15 bis unter 25 JahreAusländerInsgesamt",18526,1264,"6,8",6.8228435711972359]
["ODIIWeiblich15 bis unter 25 JahreAusländerKeine Berufsausbildung",17005,1130,"6,6",6.6451043810643924]
["ODIIWeiblich15 bis unter 25 JahreAusländerBetriebliche/schulische Ausbildung",756,72,"9,5",9.5238095238095237]
["ODIIWeiblich15 bis unter 25 JahreAusländerAkademische Ausbildung","*","*","8,1",8.1045751633986924]
["ODIIWeiblich25 bis unter 35 JahreInsgesamtInsgesamt",67946,11880,"17,5",17.484472963824214]
["ODIIWeiblich25 bis unter 35 JahreInsgesamtKeine Berufsausbildung",48028,8448,"17,6",17.589739318730739]
["ODIIWeiblich25 bis unter 35 JahreInsgesamtBetriebliche/schulische Ausbildung",12571,2544,"20,2",20.237053535915997]
["ODIIWeiblich25 bis unter 35 JahreInsgesamtAkademische Ausbildung",7347,888,"12,1",12.086565945283789]
["ODIIWeiblich25 bis unter 35 JahreDeutscheInsgesamt",31452,6669,"21,2",21.203739030904234]
["ODIIWeiblich25 bis unter 35 JahreDeutscheKeine Berufsausbildung",18670,4331,"23,2",23.197643277986074]
["ODIIWeiblich25 bis unter 35 JahreDeutscheBetriebliche/schulische Ausbildung",10139,2079,"20,5",20.504980767334057]
["ODIIWeiblich25 bis unter 35 JahreDeutscheAkademische Ausbildung",2643,259,"9,8",9.7994702989027633]
["ODIIWeiblich25 bis unter 35 JahreAusländerInsgesamt",36494,5211,"14,3",14.279059571436401]
["ODIIWeiblich25 bis unter 35 JahreAusländerKeine Berufsausbildung",29358,4117,"14,0",14.023434838885482]
["ODIIWeiblich25 bis unter 35 JahreAusländerBetriebliche/schulische Ausbildung",2432,465,"19,1",19.120065789473685]
["ODIIWeiblich25 bis unter 35 JahreAusländerAkademische Ausbildung",4704,629,"13,4",13.371598639455781]
["ODIIWeiblich35 bis unter 45 JahreInsgesamtInsgesamt",74841,13722,"18,3",18.334869924239388]
["ODIIWeiblich35 bis unter 45 JahreInsgesamtKeine Berufsausbildung",48303,8534,"17,7",17.667639691116495]
["ODIIWeiblich35 bis unter 45 JahreInsgesamtBetriebliche/schulische Ausbildung",18700,4053,"21,7",21.673796791443849]
["ODIIWeiblich35 bis unter 45 JahreInsgesamtAkademische Ausbildung",7838,1135,"14,5",14.480734881347281]
["ODIIWeiblich35 bis unter 45 JahreDeutscheInsgesamt",31953,7056,"22,1",22.082433574312272]
["ODIIWeiblich35 bis unter 45 JahreDeutscheKeine Berufsausbildung",14739,3434,"23,3",23.298731257208765]
["ODIIWeiblich35 bis unter 45 JahreDeutscheBetriebliche/schulische Ausbildung",15169,3311,"21,8",21.82741116751269]
["ODIIWeiblich35 bis unter 45 JahreDeutscheAkademische Ausbildung",2045,311,"15,2",15.207823960880196]
["ODIIWeiblich35 bis unter 45 JahreAusländerInsgesamt",42888,6666,"15,5",15.542809177392277]
["ODIIWeiblich35 bis unter 45 JahreAusländerKeine Berufsausbildung",33564,5100,"15,2",15.194851626742938]
["ODIIWeiblich35 bis unter 45 JahreAusländerBetriebliche/schulische Ausbildung",3531,742,"21,0",21.013877088643444]
["ODIIWeiblich35 bis unter 45 JahreAusländerAkademische Ausbildung",5793,824,"14,2",14.224063524943897]
["ODIIWeiblich45 bis unter 55 JahreInsgesamtInsgesamt",51130,9114,"17,8",17.82515157441815]
["ODIIWeiblich45 bis unter 55 JahreInsgesamtKeine Berufsausbildung",31019,5170,"16,7",16.667203971759246]
["ODIIWeiblich45 bis unter 55 JahreInsgesamtBetriebliche/schulische Ausbildung",16602,3323,"20,0",20.015660763763403]
["ODIIWeiblich45 bis unter 55 JahreInsgesamtAkademische Ausbildung",3509,621,"17,7",17.697349672271304]
["ODIIWeiblich45 bis unter 55 JahreDeutscheInsgesamt",24170,4581,"19,0",18.953247827885807]
["ODIIWeiblich45 bis unter 55 JahreDeutscheKeine Berufsausbildung",9357,1729,"18,5",18.478144704499304]
["ODIIWeiblich45 bis unter 55 JahreDeutscheBetriebliche/schulische Ausbildung",13782,2661,"19,3",19.30779277318241]
["ODIIWeiblich45 bis unter 55 JahreDeutscheAkademische Ausbildung",1031,191,"18,5",18.525703200775943]
["ODIIWeiblich45 bis unter 55 JahreAusländerInsgesamt",26959,4533,"16,8",16.814421899922106]
["ODIIWeiblich45 bis unter 55 JahreAusländerKeine Berufsausbildung",21662,3441,"15,9",15.884959837503462]
["ODIIWeiblich45 bis unter 55 JahreAusländerBetriebliche/schulische Ausbildung",2820,662,"23,5",23.475177304964539]
["ODIIWeiblich45 bis unter 55 JahreAusländerAkademische Ausbildung",2477,430,"17,4",17.359709325797333]
["ODIIWeiblich55 und älterInsgesamtInsgesamt",44398,8811,"19,8",19.845488535519618]
["ODIIWeiblich55 und älterInsgesamtKeine Berufsausbildung",21462,3712,"17,3",17.29568539744665]
["ODIIWeiblich55 und älterInsgesamtBetriebliche/schulische Ausbildung",20625,4587,"22,2",22.24]
["ODIIWeiblich55 und älterInsgesamtAkademische Ausbildung",2311,512,"22,2",22.154911293812201]
["ODIIWeiblich55 und älterDeutscheInsgesamt",29455,6031,"20,5",20.475301307078595]
["ODIIWeiblich55 und älterDeutscheKeine Berufsausbildung",9241,1691,"18,3",18.298885402012768]
["ODIIWeiblich55 und älterDeutscheBetriebliche/schulische Ausbildung",19101,4092,"21,4",21.422962148578609]
["ODIIWeiblich55 und älterDeutscheAkademische Ausbildung",1113,248,"22,3",22.282120395327944]
["ODIIWeiblich55 und älterAusländerInsgesamt",14943,2780,"18,6",18.604028642173592]
["ODIIWeiblich55 und älterAusländerKeine Berufsausbildung",12221,2021,"16,5",16.537108256280174]
["ODIIWeiblich55 und älterAusländerBetriebliche/schulische Ausbildung",1524,495,"32,5",32.480314960629919]
["ODIIWeiblich55 und älterAusländerAkademische Ausbildung",1198,264,"22,0",22.036727879799667]

{"sheet":"Berechnung","index":8,"n_rows":644,"n_cols":24,"rows_kept":644,"cut":false,"hidden":true,"merged":[[4,12,4,18],[1,2,1,8],[0,13,0,19]]}
[null,null,null,null,null,null,null,null,null,null,null,null,null,"RohDaten Diagramm"]
[null,null,"RiskRech_pDS",null,null,null,null,null,null,null,null,null,null,null,null,null,"Region1",null,"Region2"]
["Max_Alle",33.400491598501027,"AlleoBA","BA","SD","SWD","NRW","ND","OD",null,"Spalte Wverweis",null,null,null,"Alle Regionen\n(außer BA)",null,{"$f":"Steuer!B3","v":"BA"},null,{"$f":"Steuer!B4","v":"SD"}]
["n KlassenBer",120,593,120,119,118,118,119,119,null,2,null,"n=Anzahl Merkmalskombination für Analyse",null,{"$f":"C4","v":593},null,{"$f":"HLOOKUP($Q$3,$D$3:$I$18,$K4,0)","v":120},null,{"$f":"HLOOKUP($S$3,$D$3:$I$18,$K4,0)","v":119}]
[null,"Max",33.400491598501027,29.284064665127019,29.25409205756344,31.911663216011043,33.400491598501027,32.837301587301589,32.480314960629919,null,null,null,"Quintile zur Berechung der Risikoklassen"]
[0.8,"4. Quintil",22.258609627679853,21.730014614558684,18.644445235855681,22.048412316708987,24.950066704995219,22.573338778941991,21.796385027752741,null,3,null,"Max",null,{"$f":"C5","v":33.400491598501027},null,{"$f":"HLOOKUP($Q$3,$D$3:$I$18,$K6,0)","v":29.284064665127019},null,{"$f":"HLOOKUP($S$3,$D$3:$I$18,$K6,0)","v":29.25409205756344}]
[0.6,"3. Quintil",17.16536554113376,17.164193681118313,13.680931187949332,17.501150940019027,20.368580596794075,18.079001632013707,16.469795745542555,null,4,0.8,"4. Quintil",null,22.258609627679853,null,21.730014614558684,null,{"$f":"HLOOKUP($S$3,$D$3:$I$18,$K7,0)","v":18.644445235855681}]
[0.4,"2. Quintil",9.8645972707894742,9.2944824470326974,6.7000502830363589,9.2314399176542246,12.527172627221111,9.5867090329944418,11.237947753627196,null,5,0.6,"3. Quintil",null,17.16536554113376,null,17.164193681118313,null,13.680931187949332]
[0.2,"1. Quintil",6.5938606538622242,6.9262414403267289,5.0337652272097149,6.4866285650925191,8.8326021115205595,7.1449901664792046,7.1905584913473426,null,6,0.4,"2. Quintil",null,9.8645972707894742,null,9.2944824470326974,null,6.7000502830363589]
[null,"Min",0,0,0,0,0,0,0,null,7,0.2,"1. Quintil",null,6.5938606538622242,null,6.9262414403267289,null,5.0337652272097149]
[null,null,null,null,null,null,null,null,null,null,8,null,"Min",null,0,null,0,null,0]
["sehr hoch","Max",11.141881970821174,7.5540500505683355,10.609646821707759,9.8632508993020558,8.4504248935058079,10.263962808359597,10.683929932877177]
["hoch","4. Quintil",5.0932440865460933,4.5658209334403708,4.9635140479063491,4.5472613766899599,4.581486108201144,4.4943371469282845,5.3265892822101861,null,10,"sehr hoch","Max",null,{"$f":"C12","v":11.141881970821174},null,{"$f":"HLOOKUP($Q$3,$D$3:$I$18,$K13,0)","v":7.5540500505683355},null,{"$f":"S6-S7","v":10.609646821707759}]
["mittel","3. Quintil",7.3007682703442853,7.8697112340856155,6.980880904912973,8.2697110223648025,7.8414079695729644,8.4922925990192653,5.2318479919153589,null,11,"hoch","4. Quintil",null,5.0932440865460933,null,4.5658209334403708,null,4.9635140479063491]
["niedrig","2. Quintil",3.27073661692725,2.3682410067059685,1.666285055826644,2.7448113525617055,3.6945705157005513,2.4417188665152372,4.0473892622798537,null,12,"mittel","3. Quintil",null,7.3007682703442853,null,7.8697112340856155,null,6.980880904912973]
["sehr niedrig","1. Quintil",6.5938606538622242,6.9262414403267289,5.0337652272097149,6.4866285650925191,8.8326021115205595,7.1449901664792046,7.1905584913473426,null,13,"niedrig","2. Quintil",null,3.27073661692725,null,2.3682410067059685,null,1.666285055826644]
[null,"Min",0,0,0,0,0,0,0,null,14,"sehr niedrig","1. Quintil",null,6.5938606538622242,null,6.9262414403267289,null,5.0337652272097149]
[null,0,0,0,0,0,0,0,0,null,15,null,"Min",null,0,null,0,null,0]
[null,null,null,null,null,null,null,null,null,null,16,null,0,null,0,null,0,null,0]
[]
[null,null,null,null,null,null,null,null,null,null,null,"Risiko",null,null,{"$f":"Q21","v":14.3},null,{"$f":"IFERROR(Steuer!L4*1,NA())","v":14.3},null,{"$f":"IFERROR(Steuer!L5*1,NA())","v":10.8}]
[null,null,null,null,null,null,null,null,null,null,null,"RisikoRech",null,null,{"$f":"Q22","v":14.310723443767595},null,{"$f":"Steuer!M4","v":14.310723443767595},null,{"$f":"Steuer!M5","v":10.813578074837212}]
[]
[null,null,null,null,null,null,null,null,null,null,null,"sehr hoch",null,null,{"$f":"IF(ISERROR($Q$22),\"\",IF(AND($Q$22>=O7,$Q$22<=O6),\"x\",\"\"))","v":""},null,{"$f":"IF(ISERROR($Q$22),\"\",IF(AND($Q$22>=Q7,$Q$22<=Q6),\"x\",\"\"))","v":""},null,{"$f":"IF(ISERROR($S$22),\"\",IF(AND($S$22>=S7,$S$22<=S6),\"x\",\"\"))","v":""}]
[null,null,null,null,null,null,null,null,null,null,null,"hoch",null,null,{"$f":"IF(ISERROR($Q$22),\"\",IF(AND($Q$22>=O8,$Q$22<O7),\"x\",\"\"))","v":""},null,{"$f":"IF(ISERROR($Q$22),\"\",IF(AND($Q$22>=Q8,$Q$22<Q7),\"x\",\"\"))","v":""},null,{"$f":"IF(ISERROR($S$22),\"\",IF(AND($S$22>=S8,$S$22<S7),\"x\",\"\"))","v":""}]
[null,null,null,null,null,null,null,null,null,null,null,"mittel",null,null,{"$f":"IF(ISERROR($Q$22),\"\",IF(AND($Q$22>=O9,$Q$22<O8),\"x\",\"\"))","v":"x"},null,{"$f":"IF(ISERROR($Q$22),\"\",IF(AND($Q$22>=Q9,$Q$22<Q8),\"x\",\"\"))","v":"x"},null,{"$f":"IF(ISERROR($S$22),\"\",IF(AND($S$22>=S9,$S$22<S8),\"x\",\"\"))","v":"x"}]
[null,null,null,null,null,null,null,null,null,null,null,"niedrig",null,null,{"$f":"IF(ISERROR($Q$22),\"\",IF(AND($Q$22>=O10,$Q$22<O9),\"x\",\"\"))","v":""},null,{"$f":"IF(ISERROR($Q$22),\"\",IF(AND($Q$22>=Q10,$Q$22<Q9),\"x\",\"\"))","v":""},null,{"$f":"IF(ISERROR($S$22),\"\",IF(AND($S$22>=S10,$S$22<S9),\"x\",\"\"))","v":""}]
[null,null,null,null,null,null,null,null,null,null,null,"sehr niedrig",null,null,{"$f":"IF(ISERROR($Q$22),\"\",IF(AND($Q$22>=0,$Q$22<O10),\"x\",\"\"))","v":""},null,{"$f":"IF(ISERROR($Q$22),\"\",IF(AND($Q$22>=0,$Q$22<Q10),\"x\",\"\"))","v":""},null,{"$f":"IF(ISERROR($S$22),\"\",IF(AND($S$22>=0,$S$22<S10),\"x\",\"\"))","v":""}]
[]
[null,null,null,null,null,null,null,null,null,null,null,"Risikoklasse",null,null,{"$f":"IFERROR(INDEX($L$24:$L$28,MATCH(\"x\",$O$24:$O$28,0),1),\"\")","v":"mittel"},null,{"$f":"IFERROR(INDEX($L$24:$L$28,MATCH(\"x\",$Q$24:$Q$28,0),1),\"\")","v":"mittel"},null,{"$f":"IFERROR(INDEX($L$24:$L$28,MATCH(\"x\",$S$24:$S$28,0),1),\"\")","v":"mittel"}]
[]
[null,null,null,null,null,null,null,null,null,null,null,"Linie Risiko für Diagramm Region1",null,{"$f":"$Q$22","v":14.310723443767595},{"$f":"$Q$22","v":14.310723443767595},14.310723443767595,14.310723443767595,14.310723443767595,14.310723443767595,14.310723443767595]
[null,null,null,null,null,null,null,null,null,null,null,"Linie Risiko für Diagramm Region2",null,{"$f":"$S$22","v":10.813578074837212},{"$f":"$S$22","v":10.813578074837212},10.813578074837212,10.813578074837212,10.813578074837212,10.813578074837212,10.813578074837212]
[]
[null,null,null,null,null,null,null,null,null,null,null,"Text Linie Risiko für Diagramm RegionX",null,null,null,{"$f":"TEXT(Q21,\"#0,0\")& \"%\"&IF(ISERROR(N32),\"\",\"\")","v":"14,3%"}]
[null,null,null,null,null,null,null,null,null,null,null,null,null,null,null,{"$f":"TEXT(Q21,\"#0,0\")& \"%\"&CHAR(10)&IF(ISERROR(N32),\"\",)","v":"14,3%\n"}]
[null,null,null,null,null,null,null,null,null,null,null,"Legende für RegionX",null,null,"y","x",null,null,"y","x"]
[null,null,null,null,null,null,null,null,null,null,null,null,null,null,{"$f":"SUM(O14:$O$19)+O13/2","v":27.82955061309044},3.5,null,null,{"$f":"SUM($S14:S$19)+S13/2","v":23.949268646709562},6.5]
[null,null,null,null,null,null,null,null,null,null,null,null,null,null,{"$f":"SUM(O15:$O$19)+O14/2","v":19.711987584406806},3.5,null,null,{"$f":"SUM($S15:S$19)+S14/2","v":16.162688211902505},6.5]
[null,null,null,null,null,null,null,null,null,null,null,null,null,null,{"$f":"SUM(O16:$O$19)+O15/2","v":13.514981405961617},3.5,null,null,{"$f":"SUM($S16:S$19)+S15/2","v":10.190490735492846},6.5]
[null,null,null,null,null,null,null,null,null,null,null,null,null,null,{"$f":"SUM(O17:$O$19)+O16/2","v":8.2292289623258483},3.5,null,null,{"$f":"SUM($S17:S$19)+S16/2","v":5.8669077551230373},6.5]
[null,null,null,null,null,null,null,null,null,null,null,null,null,null,{"$f":"O17/2","v":3.2969303269311121},3.5,null,null,{"$f":"S17/2","v":2.5168826136048574},6.5]
[]
[null,null,null,null,null,null,null,null,null,null,null,null,null,null,null,0.64,{"$f":"MATCH(Q3,$D$3:$I$3,0)","v":1},1,{"$f":"MATCH(S3,$D$3:$I$3,0)","v":2},null,null,{"$f":"$P$44","v":0.64}]
[null,"IIIMännlich15 bis unter 25 JahreDeutscheKeine Berufsausbildung",null,3.9849894856691415,2.1263730726594781,3.3841711036910027,4.5997300384176096,3.8536704531574451,5.7201435161455665,null,null,null,null,null,null,{"$f":"$P$44","v":0.64},{"$f":"INDEX($D45:$I45,1,Q$44)","v":3.9849894856691415},{"$f":"$R$44","v":1},{"$f":"INDEX($D45:$I45,1,S$44)","v":2.1263730726594781},null,null,{"$f":"$P$44","v":0.64},{"$f":"E45","v":2.1263730726594781},"SD"]
[null,"IIIMännlich15 bis unter 25 JahreDeutscheBetriebliche/schulische Ausbildung",null,2.5529470582603793,1.3978872115660805,2.2626834010959875,3.1243219787372531,2.9881903853035907,3.8923267326732671,null,null,null,null,null,null,{"$f":"$P$44","v":0.64},{"$f":"INDEX($D46:$I46,1,Q$44)","v":2.5529470582603793},{"$f":"$R$44","v":1},{"$f":"INDEX($D46:$I46,1,S$44)","v":1.3978872115660805},null,null,0.64,{"$f":"E46","v":1.3978872115660805}]
[null,"IIIMännlich15 bis unter 25 JahreDeutscheAkademische Ausbildung",null,1.2725344644750796,1.2944983818770228,1.524390243902439,1.1650485436893203,0.77519379844961245,1.6574585635359116,null,null,null,null,null,null,0.64,1.2725344644750796,1,1.2944983818770228,null,null,0.64,1.2944983818770228]
[null,"IIIMännlich15 bis unter 25 JahreAusländerKeine Berufsausbildung",null,4.108844316003319,1.874188161068844,4.2165130417728962,5.7702020202020199,4.6576237947377024,5.5036757401152396,null,null,null,null,null,null,0.64,4.108844316003319,1,1.874188161068844,null,null,0.64,1.874188161068844]
[null,"IIIMännlich15 bis unter 25 JahreAusländerBetriebliche/schulische Ausbildung",null,2.8390297684674755,1.5328933361720247,3.3438485804416405,4.0919540229885056,3.8952745849297572,3.9488966318234611,null,null,null,null,null,null,0.64,2.8390297684674755,1,1.5328933361720247,null,null,0.64,1.5328933361720247]
[null,"IIIMännlich15 bis unter 25 JahreAusländerAkademische Ausbildung",null,1.937046004842615,{"$error":"#N/A"},{"$error":"#N/A"},{"$error":"#N/A"},{"$error":"#N/A"},{"$error":"#N/A"},null,null,null,null,null,null,0.64,1.937046004842615,1,{"$error":"#N/A"},null,null,0.64,{"$error":"#N/A"}]
[null,"IIIMännlich25 bis unter 35 JahreDeutscheKeine Berufsausbildung",null,9.3307951383804362,5.7322287546766439,7.5143258730673583,11.078919921195968,9.9623627006682529,11.670049289649173,null,null,null,null,null,null,0.64,9.3307951383804362,1,5.7322287546766439,null,null,0.64,5.7322287546766439]
[null,"IIIMännlich25 bis unter 35 JahreDeutscheBetriebliche/schulische Ausbildung",null,5.6292167582593367,3.6784637600385071,4.7846889952153111,6.885056734406052,6.0586580956207312,7.1708191563311745,null,null,null,null,null,null,0.64,5.6292167582593367,1,3.6784637600385071,null,null,0.64,3.6784637600385071]
[null,"IIIMännlich25 bis unter 35 JahreDeutscheAkademische Ausbildung",null,3.9129149421403837,3.0325947213189139,3.2678538645125759,3.9332913782252987,4.4834819087572102,4.8333911836167998,null,null,null,null,null,null,0.64,3.9129149421403837,1,3.0325947213189139,null,null,0.64,3.0325947213189139]
[null,"IIIMännlich25 bis unter 35 JahreAusländerKeine Berufsausbildung",null,7.6026784025422121,3.977790668766056,6.7443796835970033,10.71712093146335,9.1631032376298105,9.2602543435428988,null,null,null,null,null,null,0.64,7.6026784025422121,1,3.977790668766056,null,null,0.64,3.977790668766056]
[null,"IIIMännlich25 bis unter 35 JahreAusländerBetriebliche/schulische Ausbildung",null,5.4627927892699333,3.4432730438146826,4.74462740720067,7.9387186629526454,6.8872180451127818,7.203718048024788,null,null,null,null,null,null,0.64,5.4627927892699333,1,3.4432730438146826,null,null,0.64,3.4432730438146826]
[null,"IIIMännlich25 bis unter 35 JahreAusländerAkademische Ausbildung",null,5.2600083777152769,3.5269221725840585,3.6150983519404574,5.5194805194805197,6.5399911621741049,6.5533053114252962,null,null,null,null,null,null,0.64,5.2600083777152769,1,3.5269221725840585,null,null,0.64,3.5269221725840585]
[null,"IIIMännlich35 bis unter 45 JahreDeutscheKeine Berufsausbildung",null,10.633744855967079,6.7056792018419031,9.3026992287917736,12.431998573084812,11.079642007477059,12.743451981195433,null,null,null,null,null,null,0.64,10.633744855967079,1,6.7056792018419031,null,null,0.64,6.7056792018419031]
[null,"IIIMännlich35 bis unter 45 JahreDeutscheBetriebliche/schulische Ausbildung",null,7.6762600600823347,5.4157782515991473,7.474248042851257,9.0380270179318316,7.9368917366862117,8.5395051875498798,null,null,null,null,null,null,0.64,7.6762600600823347,1,5.4157782515991473,null,null,0.64,5.4157782515991473]
[null,"IIIMännlich35 bis unter 45 JahreDeutscheAkademische Ausbildung",null,6.1983009166107754,5.1982177539129442,6.2879788639365914,6.59869725290286,7.18954248366013,6.2101910828025479,null,null,null,null,null,null,0.64,6.1983009166107754,1,5.1982177539129442,null,null,0.64,5.1982177539129442]
[null,"IIIMännlich35 bis unter 45 JahreAusländerKeine Berufsausbildung",null,8.6954925181309086,4.6717884984747489,7.7240208560688739,12.696934419868064,9.755542922114838,11.380924517261557,null,null,null,null,null,null,0.64,8.6954925181309086,1,4.6717884984747489,null,null,0.64,4.6717884984747489]
[null,"IIIMännlich35 bis unter 45 JahreAusländerBetriebliche/schulische Ausbildung",null,7.4133763094278811,4.9564988136040071,6.8537074148296586,9.9107788762961189,9.3591516828031356,9.8737601442741205,null,null,null,null,null,null,0.64,7.4133763094278811,1,4.9564988136040071,null,null,0.64,4.9564988136040071]
[null,"IIIMännlich35 bis unter 45 JahreAusländerAkademische Ausbildung",null,6.5191175427395898,4.5066666666666668,5.755395683453238,7.0583746661579543,6.7061143984220903,8.1794195250659634,null,null,null,null,null,null,0.64,6.5191175427395898,1,4.5066666666666668,null,null,0.64,4.5066666666666668]
[null,"IIIMännlich45 bis unter 55 JahreDeutscheKeine Berufsausbildung",null,11.554122373131474,8.7280468334220327,11.264131551901336,14.38930432812146,11.217452498240675,12.386754139331458,null,null,null,null,null,null,0.64,11.554122373131474,1,8.7280468334220327,null,null,0.64,8.7280468334220327]
[null,"IIIMännlich45 bis unter 55 JahreDeutscheBetriebliche/schulische Ausbildung",null,9.4807654080746584,7.7502867442241525,9.3638914873713759,11.114680372630904,8.9755272064566523,10.265138620976588,null,null,null,null,null,null,0.64,9.4807654080746584,1,7.7502867442241525,null,null,0.64,7.7502867442241525]
[null,"IIIMännlich45 bis unter 55 JahreDeutscheAkademische Ausbildung",null,9.0933878663940018,8.1520863541163191,10.022953328232594,10.139388489208633,9.1270894136375702,8.8182001207972629,null,null,null,null,null,null,0.64,9.0933878663940018,1,8.1520863541163191,null,null,0.64,8.1520863541163191]
[null,"IIIMännlich45 bis unter 55 JahreAusländerKeine Berufsausbildung",null,9.2400134100110893,5.9437863601317726,8.2520116418421487,13.230221430955824,9.691786923213968,12.779552715654951,null,null,null,null,null,null,0.64,9.2400134100110893,1,5.9437863601317726,null,null,0.64,5.9437863601317726]
[null,"IIIMännlich45 bis unter 55 JahreAusländerBetriebliche/schulische Ausbildung",null,8.2348924547627167,5.8860859907980325,6.6939192641798675,11.200000000000001,9.8970251716247137,11.912034208918755,null,null,null,null,null,null,0.64,8.2348924547627167,1,5.8860859907980325,null,null,0.64,5.8860859907980325]
[null,"IIIMännlich45 bis unter 55 JahreAusländerAkademische Ausbildung",null,9.0419161676646702,7.9012345679012341,7.5471698113207548,9.5712861415752748,8.695652173913043,11.29177958446251,null,null,null,null,null,null,0.64,9.0419161676646702,1,7.9012345679012341,null,null,0.64,7.9012345679012341]
[null,"IIIMännlich55 und älterDeutscheKeine Berufsausbildung",null,25.675913694407747,23.98803880096273,26.857907253269918,30.707610146862486,23.94908921064923,21.834429269937615,null,null,null,null,null,null,0.64,25.675913694407747,1,23.98803880096273,null,null,0.64,23.98803880096273]
[null,"IIIMännlich55 und älterDeutscheBetriebliche/schulische Ausbildung",null,27.821262720311545,27.151546157344246,31.911663216011043,33.400491598501027,26.514703510563947,23.695873592644588,null,null,null,null,null,null,0.64,27.821262720311545,1,27.151546157344246,null,null,0.64,27.151546157344246]
[null,"IIIMännlich55 und älterDeutscheAkademische Ausbildung",null,27.841590407068477,29.25409205756344,29.303382130237253,29.274924471299098,25.51117905599083,25.487300649734202,null,null,null,null,null,null,0.64,27.841590407068477,1,29.25409205756344,null,null,0.64,29.25409205756344]
[null,"IIIMännlich55 und älterAusländerKeine Berufsausbildung",null,18.4966178381042,15.945852931054262,17.765120694331436,24.344493747478822,16.173972137274887,19.871159563924678,null,null,null,null,null,null,0.64,18.4966178381042,1,15.945852931054262,null,null,0.64,15.945852931054262]
[null,"IIIMännlich55 und älterAusländerBetriebliche/schulische Ausbildung",null,17.010804321728692,13.326110509209101,18.904593639575971,22.695924764890282,17.446808510638299,19.052523171987641,null,null,null,null,null,null,0.64,17.010804321728692,1,13.326110509209101,null,null,0.64,13.326110509209101]
[null,"IIIMännlich55 und älterAusländerAkademische Ausbildung",null,15.939204988308653,13.695652173913043,16.298342541436465,19.953051643192488,18.927444794952681,14.602587800369685,null,null,null,null,null,null,0.64,15.939204988308653,1,13.695652173913043,null,null,0.64,13.695652173913043]
[null,"IIIWeiblich15 bis unter 25 JahreDeutscheKeine Berufsausbildung",null,3.5445141127835909,1.9374796483230219,3.4994697773064685,4.2367308595584783,3.2502366677185228,4.8871527777777777,null,null,null,null,null,null,0.64,3.5445141127835909,1,1.9374796483230219,null,null,0.64,1.9374796483230219]
[null,"IIIWeiblich15 bis unter 25 JahreDeutscheBetriebliche/schulische Ausbildung",null,2.2002967359050443,1.1594846734784539,2.2064056939501779,2.8641823221435172,2.2854750941816659,3.3920360891819206,null,null,null,null,null,null,0.64,2.2002967359050443,1,1.1594846734784539,null,null,0.64,1.1594846734784539]
[null,"IIIWeiblich15 bis unter 25 JahreDeutscheAkademische Ausbildung",null,0.74906367041198507,0.35893754486719309,{"$error":"#N/A"},0.36014405762304924,1.6824395373291272,0.94966761633428298,null,null,null,null,null,null,0.64,0.74906367041198507,1,0.35893754486719309,null,null,0.64,0.35893754486719309]
[null,"IIIWeiblich15 bis unter 25 JahreAusländerKeine Berufsausbildung",null,3.7902667794264628,1.915367483296214,4.0988547317661244,5.8163980378416262,3.755656108597285,5.0167224080267561,null,null,null,null,null,null,0.64,3.7902667794264628,1,1.915367483296214,null,null,0.64,1.915367483296214]
[null,"IIIWeiblich15 bis unter 25 JahreAusländerBetriebliche/schulische Ausbildung",null,3.1491787701913942,1.8668326073428747,2.4390243902439024,4.7648902821316614,4.6087888531618439,4.666666666666667,null,null,null,null,null,null,0.64,3.1491787701913942,1,1.8668326073428747,null,null,0.64,1.8668326073428747]
[null,"IIIWeiblich15 bis unter 25 JahreAusländerAkademische Ausbildung",null,2.3835319609967498,2.0477815699658701,4.2553191489361701,{"$error":"#N/A"},2.6548672566371683,2.464788732394366,null,null,null,null,null,null,0.64,2.3835319609967498,1,2.0477815699658701,null,null,0.64,2.0477815699658701]
[null,"IIIWeiblich25 bis unter 35 JahreDeutscheKeine Berufsausbildung",null,8.1838185511171293,5.5400654624803005,7.9284963196635125,9.67741935483871,8.8584749586403966,9.0212876427829691,null,null,null,null,null,null,0.64,8.1838185511171293,1,5.5400654624803005,null,null,0.64,5.5400654624803005]
[null,"IIIWeiblich25 bis unter 35 JahreDeutscheBetriebliche/schulische Ausbildung",null,5.5824175824175821,3.9435420951840556,5.6208753697944323,6.6943341753879464,6.3091989083319948,5.9159453912733113,null,null,null,null,null,null,0.64,5.5824175824175821,1,3.9435420951840556,null,null,0.64,3.9435420951840556]
[null,"IIIWeiblich25 bis unter 35 JahreDeutscheAkademische Ausbildung",null,2.9664910561136977,2.2097853681052388,3.0793696689316175,2.9114935017788426,3.1777737425095336,3.6285362853628538,null,null,null,null,null,null,0.64,2.9664910561136977,1,2.2097853681052388,null,null,0.64,2.2097853681052388]
[null,"IIIWeiblich25 bis unter 35 JahreAusländerKeine Berufsausbildung",null,7.9690773788021101,5.5396475770925111,7.1135079609655882,10.679951057507429,9.0135312090790052,9.1259931895573221,null,null,null,null,null,null,0.64,7.9690773788021101,1,5.5396475770925111,null,null,0.64,5.5396475770925111]
[null,"IIIWeiblich25 bis unter 35 JahreAusländerBetriebliche/schulische Ausbildung",null,6.9830125995110643,5.0852761696135191,5.1162790697674421,9.7702820587380064,8.0637132901941264,9.2158859470468446,null,null,null,null,null,null,0.64,6.9830125995110643,1,5.0852761696135191,null,null,0.64,5.0852761696135191]
[null,"IIIWeiblich25 bis unter 35 JahreAusländerAkademische Ausbildung",null,5.5634807417974326,3.5141440653251679,4.372842347525892,7.4361820199778021,7.0781616907078169,6.3955950868276155,null,null,null,null,null,null,0.64,5.5634807417974326,1,3.5141440653251679,null,null,0.64,3.5141440653251679]
[null,"IIIWeiblich35 bis unter 45 JahreDeutscheKeine Berufsausbildung",null,8.8547894247376107,6.4529793843547028,7.9608237066800607,11.339600470035252,8.3821701296394959,9.8107494322482971,null,null,null,null,null,null,0.64,8.8547894247376107,1,6.4529793843547028,null,null,0.64,6.4529793843547028]
[null,"IIIWeiblich35 bis unter 45 JahreDeutscheBetriebliche/schulische Ausbildung",null,6.6991568035893856,5.5473140031467745,6.3484347657009526,8.1345491877528833,6.7284586337109511,6.8867854214802113,null,null,null,null,null,null,0.64,6.6991568035893856,1,5.5473140031467745,null,null,0.64,5.5473140031467745]
[null,"IIIWeiblich35 bis unter 45 JahreDeutscheAkademische Ausbildung",null,5.8368022917505931,5.1282051282051277,5.605234460196292,6.5906362545018009,6.3965306952161542,5.7105108631826189,null,null,null,null,null,null,0.64,5.8368022917505931,1,5.1282051282051277,null,null,0.64,5.1282051282051277]
[null,"IIIWeiblich35 bis unter 45 JahreAusländerKeine Berufsausbildung",null,9.4056049419918644,6.617807919492452,8.2731958762886588,12.550966140755184,11.082291912284839,10.784851811196488,null,null,null,null,null,null,0.64,9.4056049419918644,1,6.617807919492452,null,null,0.64,6.617807919492452]
[null,"IIIWeiblich35 bis unter 45 JahreAusländerBetriebliche/schulische Ausbildung",null,7.9889595951851566,6.221374045801527,7.6169749727965179,10.343481654957065,8.1476766390833859,9.9890829694323138,null,null,null,null,null,null,0.64,7.9889595951851566,1,6.221374045801527,null,null,0.64,6.221374045801527]
[null,"IIIWeiblich35 bis unter 45 JahreAusländerAkademische Ausbildung",null,7.0764793847468495,4.897260273972603,7.3182474723158402,8.695652173913043,7.2353389185072352,8.4146817649355725,null,null,null,null,null,null,0.64,7.0764793847468495,1,4.897260273972603,null,null,0.64,4.897260273972603]
[null,"IIIWeiblich45 bis unter 55 JahreDeutscheKeine Berufsausbildung",null,9.7940700095858251,7.7206786328989434,9.0398126463700237,12.711979378646046,8.8139987038237191,10.868555503947979,null,null,null,null,null,null,0.64,9.7940700095858251,1,7.7206786328989434,null,null,0.64,7.7206786328989434]
[null,"IIIWeiblich45 bis unter 55 JahreDeutscheBetriebliche/schulische Ausbildung",null,8.0106585798222838,6.6986430533349726,7.8483161965852286,9.7524808942625754,7.4403250380904007,8.5789006678186155,null,null,null,null,null,null,0.64,8.0106585798222838,1,6.6986430533349726,null,null,0.64,6.6986430533349726]
[null,"IIIWeiblich45 bis unter 55 JahreDeutscheAkademische Ausbildung",null,7.0045035197411565,6.6029687766592735,7.5934110084371227,7.4284511784511782,7.2244289970208539,6.6538930499912912,null,null,null,null,null,null,0.64,7.0045035197411565,1,6.6029687766592735,null,null,0.64,6.6029687766592735]
[null,"IIIWeiblich45 bis unter 55 JahreAusländerKeine Berufsausbildung",null,10.020515708596484,7.1490094745908701,9.240471620510009,13.96085740913327,9.8279457768508873,13.367609254498714,null,null,null,null,null,null,0.64,10.020515708596484,1,7.1490094745908701,null,null,0.64,7.1490094745908701]
[null,"IIIWeiblich45 bis unter 55 JahreAusländerBetriebliche/schulische Ausbildung",null,7.8734430402763884,6.2623166192248743,7.9552925706771855,9.5693779904306222,8.0903790087463552,10.213940648723257,null,null,null,null,null,null,0.64,7.8734430402763884,1,6.2623166192248743,null,null,0.64,6.2623166192248743]
[null,"IIIWeiblich45 bis unter 55 JahreAusländerAkademische Ausbildung",null,7.6831976313841599,5.3466243769823292,7.6744186046511631,8.6530612244897949,9.4866071428571423,9.1895341416719845,null,null,null,null,null,null,0.64,7.6831976313841599,1,5.3466243769823292,null,null,0.64,5.3466243769823292]
[null,"IIIWeiblich55 und älterDeutscheKeine Berufsausbildung",null,25.585668350941663,26.3816054860831,25.752334832237977,29.797504120555686,22.273024167210973,21.213991769547324,null,null,null,null,null,null,0.64,25.585668350941663,1,26.3816054860831,null,null,0.64,26.3816054860831]
[null,"IIIWeiblich55 und älterDeutscheBetriebliche/schulische Ausbildung",null,24.307970196432606,23.081393361364647,24.676150361598985,28.371857910941596,22.054817368099183,23.73631652997495,null,null,null,null,null,null,0.64,24.307970196432606,1,23.081393361364647,null,null,0.64,23.081393361364647]
[null,"IIIWeiblich55 und älterDeutscheAkademische Ausbildung",null,20.804148094241789,20.818059039166506,20.957095709570957,20.874704491725769,17.95351322468608,22.354043084608179,null,null,null,null,null,null,0.64,20.804148094241789,1,20.818059039166506,null,null,0.64,20.818059039166506]
[null,"IIIWeiblich55 und älterAusländerKeine Berufsausbildung",null,19.20935412026726,17.697355339033606,19.182231196365471,22.126324048646527,19.228619340413637,19.362745098039216,null,null,null,null,null,null,0.64,19.20935412026726,1,17.697355339033606,null,null,0.64,17.697355339033606]
[null,"IIIWeiblich55 und älterAusländerBetriebliche/schulische Ausbildung",null,17.518730718378141,15.603939865215139,17.435158501440924,21.796407185628741,17.164179104477611,18.198529411764707,null,null,null,null,null,null,0.64,17.518730718378141,1,15.603939865215139,null,null,0.64,15.603939865215139]
[null,"IIIWeiblich55 und älterAusländerAkademische Ausbildung",null,15.216379711493719,13.368983957219251,15.053763440860216,15.365239294710328,13.87900355871886,19.144144144144143,null,null,null,null,null,null,0.64,15.216379711493719,1,13.368983957219251,null,null,0.64,13.368983957219251]
[null,"IIMännlich15 bis unter 25 JahreDeutscheKeine Berufsausbildung",null,13.769655267958161,10.052479189287007,13.695114125951049,14.964488931345269,12.994115199429352,14.871406322347097,null,null,null,null,null,null,0.64,13.769655267958161,1,10.052479189287007,null,null,0.64,10.052479189287007]
[null,"IIMännlich15 bis unter 25 JahreDeutscheBetriebliche/schulische Ausbildung",null,12.316817864619679,8.0597014925373127,14.0893470790378,13.528336380255942,11.056511056511056,14.207650273224044,null,null,null,null,null,null,0.64,12.316817864619679,1,8.0597014925373127,null,null,0.64,8.0597014925373127]
[null,"IIMännlich15 bis unter 25 JahreDeutscheAkademische Ausbildung",null,7.0707070707070701,5.825242718446602,9.5238095238095237,10.526315789473683,4.4943820224719104,6.6265060240963862,null,null,null,null,null,null,0.64,7.0707070707070701,1,5.825242718446602,null,null,0.64,5.825242718446602]
[null,"IIMännlich15 bis unter 25 JahreAusländerKeine Berufsausbildung",null,9.5387626932017451,6.5289741581832414,10.041898482038601,12.568956621820057,9.2964144719052513,8.6266426178819895,null,null,null,null,null,null,0.64,9.5387626932017451,1,6.5289741581832414,null,null,0.64,6.5289741581832414]
[null,"IIMännlich15 bis unter 25 JahreAusländerBetriebliche/schulische Ausbildung",null,9.8818897637795278,7.5667655786350156,11.285266457680251,10.931174089068826,8.9285714285714288,12.170385395537526,null,null,null,null,null,null,0.64,9.8818897637795278,1,7.5667655786350156,null,null,{"$f":"$P$44","v":0.64},7.5667655786350156]
[null,"IIMännlich15 bis unter 25 JahreAusländerAkademische Ausbildung",null,8.5106382978723403,6.6202090592334493,7.2727272727272725,13.596491228070176,6.9565217391304346,7.9646017699115044,null,null,null,null,null,null,{"$f":"$P$44","v":0.64},{"$f":"INDEX($D110:$I110,1,Q$44)","v":8.5106382978723403},{"$f":"$R$44","v":1},{"$f":"INDEX($D110:$I110,1,S$44)","v":6.6202090592334493},null,null,0.64,{"$f":"E110","v":6.6202090592334493}]
[null,"IIMännlich25 bis unter 35 JahreDeutscheKeine Berufsausbildung",null,24.322600841748891,19.807004408951002,24.894359728091125,26.020428926057054,24.338686131386861,24.602661245610793,null,null,null,null,null,null,0.64,24.322600841748891,1,19.807004408951002,null,null,0.64,19.807004408951002]
[null,"IIMännlich25 bis unter 35 JahreDeutscheBetriebliche/schulische Ausbildung",null,21.630323034467832,17.644527327499642,22.304317709535905,24.343902149388434,20.951286104325334,22.285992217898833,null,null,null,null,null,null,0.64,21.630323034467832,1,17.644527327499642,null,null,0.64,17.644527327499642]
[null,"IIMännlich25 bis unter 35 JahreDeutscheAkademische Ausbildung",null,11.308091680384956,8.0699774266365694,11.503416856492027,13.777490297542045,10.457516339869281,12.713035467526485,null,null,null,null,null,null,0.64,11.308091680384956,1,8.0699774266365694,null,null,0.64,8.0699774266365694]
[null,"IIMännlich25 bis unter 35 JahreAusländerKeine Berufsausbildung",null,17.253981315649352,13.217391304347824,17.207671465759976,20.242049623061149,18.110373733845616,16.200545702592088,null,null,null,null,null,null,0.64,17.253981315649352,1,13.217391304347824,null,null,0.64,13.217391304347824]
[null,"IIMännlich25 bis unter 35 JahreAusländerBetriebliche/schulische Ausbildung",null,17.859327217125383,13.622047244094487,17.170111287758345,20.151770657672849,19.570011025358326,19.550930996714129,null,null,null,null,null,null,0.64,17.859327217125383,1,13.622047244094487,null,null,0.64,13.622047244094487]
[null,"IIMännlich25 bis unter 35 JahreAusländerAkademische Ausbildung",null,11.99641094661283,9.375,8.4981684981684982,14.495114006514658,13.525179856115107,12.762818148284765,null,null,null,null,null,null,0.64,11.99641094661283,1,9.375,null,null,0.64,9.375]
[null,"IIMännlich35 bis unter 45 JahreDeutscheKeine Berufsausbildung",null,26.248996479960478,22.236987818383167,26.40144665461121,27.250650477016482,26.778207499579622,26.85662644197544,null,null,null,null,null,null,0.64,26.248996479960478,1,22.236987818383167,null,null,0.64,22.236987818383167]
[null,"IIMännlich35 bis unter 45 JahreDeutscheBetriebliche/schulische Ausbildung",null,24.651412967023873,20.172435653607202,24.9757045675413,27.369151467089615,23.333756506284118,25.609826422928322,null,null,null,null,null,null,0.64,24.651412967023873,1,20.172435653607202,null,null,0.64,20.172435653607202]
[null,"IIMännlich35 bis unter 45 JahreDeutscheAkademische Ausbildung",null,20.232079356166949,18.493150684931507,19.6113074204947,23.967684021543985,19.957761351636748,19.185360094451003,null,null,null,null,null,null,0.64,20.232079356166949,1,18.493150684931507,null,null,0.64,18.493150684931507]
[null,"IIMännlich35 bis unter 45 JahreAusländerKeine Berufsausbildung",null,19.22291320919884,14.718595817141859,19.318387817995045,22.633662707522372,20.449997559666162,17.897091722595079,null,null,null,null,null,null,0.64,19.22291320919884,1,14.718595817141859,null,null,0.64,14.718595817141859]
[null,"IIMännlich35 bis unter 45 JahreAusländerBetriebliche/schulische Ausbildung",null,20.844875346260388,17.078119715928306,19.613075383589059,22.917375042502549,23.275434243176178,21.77570093457944,null,null,null,null,null,null,0.64,20.844875346260388,1,17.078119715928306,null,null,0.64,17.078119715928306]
[null,"IIMännlich35 bis unter 45 JahreAusländerAkademische Ausbildung",null,15.628066732090284,12.42015613910575,12.87313432835821,18.149081742888011,18.440036068530208,15.710723192019952,null,null,null,null,null,null,0.64,15.628066732090284,1,12.42015613910575,null,null,0.64,12.42015613910575]
[null,"IIMännlich45 bis unter 55 JahreDeutscheKeine Berufsausbildung",null,23.690488538533348,20.324891276541315,24.715504978662871,26.057658909343523,22.98673248997223,23.062470643494599,null,null,null,null,null,null,0.64,23.690488538533348,1,20.324891276541315,null,null,0.64,20.324891276541315]
[null,"IIMännlich45 bis unter 55 JahreDeutscheBetriebliche/schulische Ausbildung",null,23.260561052897607,19.06696065916212,25.441906653426017,25.027553269654668,22.835105761364964,23.781485116126923,null,null,null,null,null,null,0.64,23.260561052897607,1,19.06696065916212,null,null,0.64,19.06696065916212]
[null,"IIMännlich45 bis unter 55 JahreDeutscheAkademische Ausbildung",null,24.65940054495913,19.88950276243094,26.056338028169012,27.849740932642487,23.294723294723294,26.158599382080329,null,null,null,null,null,null,0.64,24.65940054495913,1,19.88950276243094,null,null,0.64,19.88950276243094]
[null,"IIMännlich45 bis unter 55 JahreAusländerKeine Berufsausbildung",null,21.282979267291832,16.791869200176755,21.606188985080124,24.603439241651976,22.699939867708959,19.713449853724402,null,null,null,null,null,null,0.64,21.282979267291832,1,16.791869200176755,null,null,0.64,16.791869200176755]
[null,"IIMännlich45 bis unter 55 JahreAusländerBetriebliche/schulische Ausbildung",null,22.506009615384613,18.385812522620341,24.511400651465799,23.986735445836405,26.116838487972512,22.313596491228072,null,null,null,null,null,null,0.64,22.506009615384613,1,18.385812522620341,null,null,0.64,18.385812522620341]
[null,"IIMännlich45 bis unter 55 JahreAusländerAkademische Ausbildung",null,18.120805369127517,15.703069236259815,13.588390501319262,19.900849858356938,20.845341018251681,19.213649851632049,null,null,null,null,null,null,0.64,18.120805369127517,1,15.703069236259815,null,null,0.64,15.703069236259815]
[null,"IIMännlich55 und älterDeutscheKeine Berufsausbildung",null,22.128780934922091,19.431343484705565,24.498656191854458,24.090265634107752,22.488938053097346,20.361947159585796,null,null,null,null,null,null,0.64,22.128780934922091,1,19.431343484705565,null,null,0.64,19.431343484705565]
[null,"IIMännlich55 und älterDeutscheBetriebliche/schulische Ausbildung",null,23.255608080593472,20.327184128089105,24.066047471620227,25.350560897435898,24.981853375272202,22.695522267533409,null,null,null,null,null,null,0.64,23.255608080593472,1,20.327184128089105,null,null,0.64,20.327184128089105]
[null,"IIMännlich55 und älterDeutscheAkademische Ausbildung",null,28.065183652353852,27.348066298342545,31.067961165048541,32.223701731025301,28.338278931750743,24.980842911877392,null,null,null,null,null,null,0.64,28.065183652353852,1,27.348066298342545,null,null,0.64,27.348066298342545]
[null,"IIMännlich55 und älterAusländerKeine Berufsausbildung",null,22.74791303550133,19.171943497320992,23.051627754028281,26.962242047400199,24.240844519744559,19.995286909390835,null,null,null,null,null,null,0.64,22.74791303550133,1,19.171943497320992,null,null,0.64,19.171943497320992]
[null,"IIMännlich55 und älterAusländerBetriebliche/schulische Ausbildung",null,24.711235561778089,21.349050425671251,21.1781206171108,28.742038216560513,28.125,24.357034795763994,null,null,null,null,null,null,0.64,24.711235561778089,1,21.349050425671251,null,null,0.64,21.349050425671251]
[null,"IIMännlich55 und älterAusländerAkademische Ausbildung",null,24.123076923076923,23.450134770889488,18.867924528301888,27.194244604316548,28.030303030303028,22.415795586527292,null,null,null,null,null,null,0.64,24.123076923076923,1,23.450134770889488,null,null,0.64,23.450134770889488]
[null,"IIWeiblich15 bis unter 25 JahreDeutscheKeine Berufsausbildung",null,12.676470195402759,9.1891891891891895,12.276214833759591,14.503052747472726,12.397321736729481,12.935464102201481,null,null,null,null,null,null,0.64,12.676470195402759,1,9.1891891891891895,null,null,0.64,9.1891891891891895]
[null,"IIWeiblich15 bis unter 25 JahreDeutscheBetriebliche/schulische Ausbildung",null,10.532212885154062,7.2156196943972839,12.125984251968504,13.420621931260229,8.6700955180014692,11.224489795918368,null,null,null,null,null,null,0.64,10.532212885154062,1,7.2156196943972839,null,null,0.64,7.2156196943972839]
[null,"IIWeiblich15 bis unter 25 JahreDeutscheAkademische Ausbildung",null,5.6666666666666661,3.9473684210526314,3.8961038961038961,9.3333333333333339,4.9450549450549453,5.6047197640117989,null,null,null,null,null,null,0.64,5.6666666666666661,1,3.9473684210526314,null,null,0.64,3.9473684210526314]
[null,"IIWeiblich15 bis unter 25 JahreAusländerKeine Berufsausbildung",null,7.9690404648606936,5.4586201376660801,9.1953131062310867,10.798823474485269,7.5263259900510375,6.6451043810643924,null,null,null,null,null,null,0.64,7.9690404648606936,1,5.4586201376660801,null,null,0.64,5.4586201376660801]
[null,"IIWeiblich15 bis unter 25 JahreAusländerBetriebliche/schulische Ausbildung",null,8.524096385542169,5.7405281285878305,7.4935400516795871,10.112359550561797,10.102489019033674,9.5238095238095237,null,null,null,null,null,null,0.64,8.524096385542169,1,5.7405281285878305,null,null,0.64,5.7405281285878305]
[null,"IIWeiblich15 bis unter 25 JahreAusländerAkademische Ausbildung",null,7.8780561424690614,6.6523605150214591,5.0397877984084882,10.747663551401869,8.2077051926298168,8.1045751633986924,null,null,null,null,null,null,0.64,7.8780561424690614,1,6.6523605150214591,null,null,0.64,6.6523605150214591]
[null,"IIWeiblich25 bis unter 35 JahreDeutscheKeine Berufsausbildung",null,24.391410724292996,19.873380156296371,24.396161905812285,27.271857204383405,24.927174365376612,23.197643277986074,null,null,null,null,null,null,0.64,24.391410724292996,1,19.873380156296371,null,null,0.64,19.873380156296371]
[null,"IIWeiblich25 bis unter 35 JahreDeutscheBetriebliche/schulische Ausbildung",null,20.558888344760039,17.752729834448751,20.635775862068968,23.30472103004292,20.071509832601983,20.504980767334057,null,null,null,null,null,null,0.64,20.558888344760039,1,17.752729834448751,null,null,0.64,17.752729834448751]
[null,"IIWeiblich25 bis unter 35 JahreDeutscheAkademische Ausbildung",null,9.2039524814033538,6.1013443640124096,9.4882729211087415,11.303827751196172,9.5604395604395602,9.7994702989027633,null,null,null,null,null,null,0.64,9.2039524814033538,1,6.1013443640124096,null,null,0.64,6.1013443640124096]
[null,"IIWeiblich25 bis unter 35 JahreAusländerKeine Berufsausbildung",null,17.104335258097624,13.444540439954809,17.846492636601365,21.636173836602385,17.864685177942903,14.023434838885482,null,null,null,null,null,null,0.64,17.104335258097624,1,13.444540439954809,null,null,0.64,13.444540439954809]
[null,"IIWeiblich25 bis unter 35 JahreAusländerBetriebliche/schulische Ausbildung",null,20.24800868935554,16.225276567214213,18.125,23.474968447623056,25.82599118942731,19.120065789473685,null,null,null,null,null,null,0.64,20.24800868935554,1,16.225276567214213,null,null,0.64,16.225276567214213]
[null,"IIWeiblich25 bis unter 35 JahreAusländerAkademische Ausbildung",null,13.224286110341005,9.6551724137931032,9.932279909706546,15.527401296405422,17.818407189339943,13.371598639455781,null,null,null,null,null,null,0.64,13.224286110341005,1,9.6551724137931032,null,null,0.64,9.6551724137931032]
[null,"IIWeiblich35 bis unter 45 JahreDeutscheKeine Berufsausbildung",null,24.499644152823343,21.283217620301652,25.089952947688904,27.133012136366407,24.235747727898652,23.298731257208765,null,null,null,null,null,null,0.64,24.499644152823343,1,21.283217620301652,null,null,0.64,21.283217620301652]
[null,"IIWeiblich35 bis unter 45 JahreDeutscheBetriebliche/schulische Ausbildung",null,22.147407174171047,18.871387062241933,22.738897930713787,25.309541150764748,21.818181818181817,21.82741116751269,null,null,null,null,null,null,0.64,22.147407174171047,1,18.871387062241933,null,null,0.64,18.871387062241933]
[null,"IIWeiblich35 bis unter 45 JahreDeutscheAkademische Ausbildung",null,16.359566040985019,15.157116451016636,20.24866785079929,16.502242152466369,17.664670658682635,15.207823960880196,null,null,null,null,null,null,0.64,16.359566040985019,1,15.157116451016636,null,null,0.64,15.157116451016636]
[null,"IIWeiblich35 bis unter 45 JahreAusländerKeine Berufsausbildung",null,18.006632555276134,13.794232464425136,19.041074373674704,22.421152204508225,19.466498355645616,15.194851626742938,null,null,null,null,null,null,0.64,18.006632555276134,1,13.794232464425136,null,null,0.64,13.794232464425136]
[null,"IIWeiblich35 bis unter 45 JahreAusländerBetriebliche/schulische Ausbildung",null,20.815585066399397,15.818431911966988,19.154228855721392,24.833836858006041,24.863685932388222,21.013877088643444,null,null,null,null,null,null,0.64,20.815585066399397,1,15.818431911966988,null,null,0.64,15.818431911966988]
[null,"IIWeiblich35 bis unter 45 JahreAusländerAkademische Ausbildung",null,14.78171334431631,10.921553693830921,10.16949152542373,18.187619655392471,21.372740595994138,14.224063524943897,null,null,null,null,null,null,0.64,14.78171334431631,1,10.921553693830921,null,null,0.64,10.921553693830921]
[null,"IIWeiblich45 bis unter 55 JahreDeutscheKeine Berufsausbildung",null,20.044296788482836,16.897324370633978,21.563727240271334,22.795078022960062,19.030720876001219,18.478144704499304,null,null,null,null,null,null,0.64,20.044296788482836,1,16.897324370633978,null,null,0.64,16.897324370633978]
[null,"IIWeiblich45 bis unter 55 JahreDeutscheBetriebliche/schulische Ausbildung",null,18.964974006196503,15.562862063566621,20.127177218689521,21.469072164948454,17.951070336391435,19.30779277318241,null,null,null,null,null,null,0.64,18.964974006196503,1,15.562862063566621,null,null,0.64,15.562862063566621]
[null,"IIWeiblich45 bis unter 55 JahreDeutscheAkademische Ausbildung",null,19.250685348766371,16.512345679012348,19.219219219219219,23.946037099494095,18.87905604719764,18.525703200775943,null,null,null,null,null,null,0.64,19.250685348766371,1,16.512345679012348,null,null,0.64,16.512345679012348]
[null,"IIWeiblich45 bis unter 55 JahreAusländerKeine Berufsausbildung",null,19.261399612952708,15.175902506323293,21.395319967723918,23.407221525163809,20.611077048845289,15.884959837503462,null,null,null,null,null,null,0.64,19.261399612952708,1,15.175902506323293,null,null,0.64,15.175902506323293]
[null,"IIWeiblich45 bis unter 55 JahreAusländerBetriebliche/schulische Ausbildung",null,21.532904036437884,16.353811149032992,20.843672456575682,26.073736221968836,22.412993039443155,23.475177304964539,null,null,null,null,null,null,0.64,21.532904036437884,1,16.353811149032992,null,null,0.64,16.353811149032992]
[null,"IIWeiblich45 bis unter 55 JahreAusländerAkademische Ausbildung",null,15.958433846724809,11.806495263870096,12.232204561161023,19.074598677998111,20.224719101123593,17.359709325797333,null,null,null,null,null,null,0.64,15.958433846724809,1,11.806495263870096,null,null,0.64,11.806495263870096]
[null,"IIWeiblich55 und älterDeutscheKeine Berufsausbildung",null,19.974244584463964,18.48078411142636,21.793103448275865,22.141680395387151,19.059939629150495,18.298885402012768,null,null,null,null,null,null,0.64,19.974244584463964,1,18.48078411142636,null,null,0.64,18.48078411142636]
[null,"IIWeiblich55 und älterDeutscheBetriebliche/schulische Ausbildung",null,20.734580068265949,17.98342074099137,22.21861822899773,21.868070953436806,19.202034652678428,21.422962148578609,null,null,null,null,null,null,0.64,20.734580068265949,1,17.98342074099137,null,null,0.64,17.98342074099137]
[null,"IIWeiblich55 und älterDeutscheAkademische Ausbildung",null,24.608724608724607,21.442495126705651,28.517110266159694,27.541589648798521,27.399650959860384,22.282120395327944,null,null,null,null,null,null,0.64,24.608724608724607,1,21.442495126705651,null,null,0.64,21.442495126705651]
[null,"IIWeiblich55 und älterAusländerKeine Berufsausbildung",null,20.887425525243021,17.998684918405164,23.263382336438109,25.904683872729755,21.493834826576776,16.537108256280174,null,null,null,null,null,null,0.64,20.887425525243021,1,17.998684918405164,null,null,0.64,17.998684918405164]
[null,"IIWeiblich55 und älterAusländerBetriebliche/schulische Ausbildung",null,29.284064665127019,25.6561328334226,22.356828193832598,33.164983164983163,32.837301587301589,32.480314960629919,null,null,null,null,null,null,0.64,29.284064665127019,1,25.6561328334226,null,null,0.64,25.6561328334226]
[null,"IIWeiblich55 und älterAusländerAkademische Ausbildung",null,22.903021339530952,19.573796369376481,19.402985074626866,26.525821596244132,28.167281672816731,22.036727879799667,null,null,null,null,null,null,0.64,22.903021339530952,1,19.573796369376481,null,null,0.64,19.573796369376481]
[null,null,null,null,null,null,null,null,null,null,null,null,null,null,null,null,null,null,null,null,null,0.64,{"$f":"F45","v":3.3841711036910027},"SWD"]
[null,null,null,null,null,null,null,null,null,null,null,null,null,null,null,null,null,null,null,null,null,0.64,{"$f":"F46","v":2.2626834010959875}]
[null,null,null,null,null,null,null,null,null,null,null,null,null,null,null,null,null,null,null,null,null,0.64,1.524390243902439]
[null,null,null,null,null,null,null,null,null,null,null,null,null,null,null,null,null,null,null,null,null,0.64,4.2165130417728962]
[null,null,null,null,null,null,null,null,null,null,null,null,null,null,null,null,null,null,null,null,null,0.64,3.3438485804416405]
[null,null,null,null,null,null,null,null,null,null,null,null,null,null,null,null,null,null,null,null,null,0.64,{"$error":"#N/A"}]
[null,null,null,null,null,null,null,null,null,null,null,null,null,null,null,null,null,null,null,null,null,0.64,7.5143258730673583]
[null,null,null,null,null,null,null,null,null,null,null,null,null,null,null,null,null,null,null,null,null,0.64,4.7846889952153111]
[null,null,null,null,null,null,null,null,null,null,null,null,null,null,null,null,null,null,null,null,null,{"$f":"$P$44","v":0.64},3.2678538645125759]
[null,null,null,null,null,null,null,null,null,null,null,null,null,null,null,null,null,null,null,null,null,0.64,6.7443796835970033]
[null,null,null,null,null,null,null,null,null,null,null,null,null,null,null,null,null,null,null,null,null,0.64,4.74462740720067]
[null,null,null,null,null,null,null,null,null,null,null,null,null,null,null,null,null,null,null,null,null,0.64,3.6150983519404574]
[null,null,null,null,null,null,null,null,null,null,null,null,null,null,null,null,null,null,null,null,null,0.64,9.3026992287917736]
[null,null,null,null,null,null,null,null,null,null,null,null,null,null,null,null,null,null,null,null,null,0.64,7.474248042851257]
[null,null,null,null,null,null,null,null,null,null,null,null,null,null,null,null,null,null,null,null,null,0.64,6.2879788639365914]
[null,null,null,null,null,null,null,null,null,null,null,null,null,null,null,null,null,null,null,null,null,0.64,7.7240208560688739]
[null,null,null,null,null,null,null,null,null,null,null,null,null,null,null,null,null,null,null,null,null,0.64,6.8537074148296586]
[null,null,null,null,null,null,null,null,null,null,null,null,null,null,null,null,null,null,null,null,null,0.64,5.755395683453238]
[null,null,null,null,null,null,null,null,null,null,null,null,null,null,null,null,null,null,null,null,null,0.64,11.264131551901336]
[null,null,null,null,null,null,null,null,null,null,null,null,null,null,null,null,null,null,null,null,null,0.64,9.3638914873713759]
[null,null,null,null,null,null,null,null,null,null,null,null,null,null,null,null,null,null,null,null,null,0.64,10.022953328232594]
[null,null,null,null,null,null,null,null,null,null,null,null,null,null,null,null,null,null,null,null,null,0.64,8.2520116418421487]
[null,null,null,null,null,null,null,null,null,null,null,null,null,null,null,null,null,null,null,null,null,0.64,6.6939192641798675]
[null,null,null,null,null,null,null,null,null,null,null,null,null,null,null,null,null,null,null,null,null,0.64,7.5471698113207548]
[null,null,null,null,null,null,null,null,null,null,null,null,null,null,null,null,null,null,null,null,null,0.64,26.857907253269918]
[null,null,null,null,null,null,null,null,null,null,null,null,null,null,null,null,null,null,null,null,null,0.64,31.911663216011043]
[null,null,null,null,null,null,null,null,null,null,null,null,null,null,null,null,null,null,null,null,null,0.64,29.303382130237253]
[null,null,null,null,null,null,null,null,null,null,null,null,null,null,null,null,null,null,null,null,null,0.64,17.765120694331436]
[null,null,null,null,null,null,null,null,null,null,null,null,null,null,null,null,null,null,null,null,null,0.64,18.904593639575971]
[null,null,null,null,null,null,null,null,null,null,null,null,null,null,null,null,null,null,null,null,null,0.64,16.298342541436465]
[null,null,null,null,null,null,null,null,null,null,null,null,null,null,null,null,null,null,null,null,null,0.64,3.4994697773064685]
[null,null,null,null,null,null,null,null,null,null,null,null,null,null,null,null,null,null,null,null,null,0.64,2.2064056939501779]
[null,null,null,null,null,null,null,null,null,null,null,null,null,null,null,null,null,null,null,null,null,0.64,{"$error":"#N/A"}]
[null,null,null,null,null,null,null,null,null,null,null,null,null,null,null,null,null,null,null,null,null,0.64,4.0988547317661244]
[null,null,null,null,null,null,null,null,null,null,null,null,null,null,null,null,null,null,null,null,null,0.64,2.4390243902439024]
[null,null,null,null,null,null,null,null,null,null,null,null,null,null,null,null,null,null,null,null,null,0.64,4.2553191489361701]
[null,null,null,null,null,null,null,null,null,null,null,null,null,null,null,null,null,null,null,null,null,0.64,7.9284963196635125]
[null,null,null,null,null,null,null,null,null,null,null,null,null,null,null,null,null,null,null,null,null,0.64,5.6208753697944323]
[null,null,null,null,null,null,null,null,null,null,null,null,null,null,null,null,null,null,null,null,null,0.64,3.0793696689316175]
[null,null,null,null,null,null,null,null,null,null,null,null,null,null,null,null,null,null,null,null,null,0.64,7.1135079609655882]
[null,null,null,null,null,null,null,null,null,null,null,null,null,null,null,null,null,null,null,null,null,0.64,5.1162790697674421]
[null,null,null,null,null,null,null,null,null,null,null,null,null,null,null,null,null,null,null,null,null,0.64,4.372842347525892]
[null,null,null,null,null,null,null,null,null,null,null,null,null,null,null,null,null,null,null,null,null,0.64,7.9608237066800607]
[null,null,null,null,null,null,null,null,null,null,null,null,null,null,null,null,null,null,null,null,null,0.64,6.3484347657009526]
[null,null,null,null,null,null,null,null,null,null,null,null,null,null,null,null,null,null,null,null,null,0.64,5.605234460196292]
[null,null,null,null,null,null,null,null,null,null,null,null,null,null,null,null,null,null,null,null,null,0.64,8.2731958762886588]
[null,null,null,null,null,null,null,null,null,null,null,null,null,null,null,null,null,null,null,null,null,0.64,7.6169749727965179]
[null,null,null,null,null,null,null,null,null,null,null,null,null,null,null,null,null,null,null,null,null,0.64,7.3182474723158402]
[null,null,null,null,null,null,null,null,null,null,null,null,null,null,null,null,null,null,null,null,null,0.64,9.0398126463700237]
[null,null,null,null,null,null,null,null,null,null,null,null,null,null,null,null,null,null,null,null,null,0.64,7.8483161965852286]
[null,null,null,null,null,null,null,null,null,null,null,null,null,null,null,null,null,null,null,null,null,0.64,7.5934110084371227]
[null,null,null,null,null,null,null,null,null,null,null,null,null,null,null,null,null,null,null,null,null,0.64,9.240471620510009]
[null,null,null,null,null,null,null,null,null,null,null,null,null,null,null,null,null,null,null,null,null,0.64,7.9552925706771855]
[null,null,null,null,null,null,null,null,null,null,null,null,null,null,null,null,null,null,null,null,null,0.64,7.6744186046511631]
[null,null,null,null,null,null,null,null,null,null,null,null,null,null,null,null,null,null,null,null,null,0.64,25.752334832237977]
[null,null,null,null,null,null,null,null,null,null,null,null,null,null,null,null,null,null,null,null,null,0.64,24.676150361598985]
[null,null,null,null,null,null,null,null,null,null,null,null,null,null,null,null,null,null,null,null,null,0.64,20.957095709570957]
[null,null,null,null,null,null,null,null,null,null,null,null,null,null,null,null,null,null,null,null,null,0.64,19.182231196365471]
[null,null,null,null,null,null,null,null,null,null,null,null,null,null,null,null,null,null,null,null,null,0.64,17.435158501440924]
[null,null,null,null,null,null,null,null,null,null,null,null,null,null,null,null,null,null,null,null,null,0.64,15.053763440860216]
[null,null,null,null,null,null,null,null,null,null,null,null,null,null,null,null,null,null,null,null,null,0.64,13.695114125951049]
[null,null,null,null,null,null,null,null,null,null,null,null,null,null,null,null,null,null,null,null,null,0.64,14.0893470790378]
[null,null,null,null,null,null,null,null,null,null,null,null,null,null,null,null,null,null,null,null,null,0.64,9.5238095238095237]
[null,null,null,null,null,null,null,null,null,null,null,null,null,null,null,null,null,null,null,null,null,0.64,10.041898482038601]
[null,null,null,null,null,null,null,null,null,null,null,null,null,null,null,null,null,null,null,null,null,0.64,11.285266457680251]
[null,null,null,null,null,null,null,null,null,null,null,null,null,null,null,null,null,null,null,null,null,0.64,{"$f":"F110","v":7.2727272727272725}]
[null,null,null,null,null,null,null,null,null,null,null,null,null,null,null,null,null,null,null,null,null,0.64,24.894359728091125]
[null,null,null,null,null,null,null,null,null,null,null,null,null,null,null,null,null,null,null,null,null,0.64,22.304317709535905]
[null,null,null,null,null,null,null,null,null,null,null,null,null,null,null,null,null,null,null,null,null,0.64,11.503416856492027]
[null,null,null,null,null,null,null,null,null,null,null,null,null,null,null,null,null,null,null,null,null,0.64,17.207671465759976]
[null,null,null,null,null,null,null,null,null,null,null,null,null,null,null,null,null,null,null,null,null,0.64,17.170111287758345]
[null,null,null,null,null,null,null,null,null,null,null,null,null,null,null,null,null,null,null,null,null,0.64,8.4981684981684982]
[null,null,null,null,null,null,null,null,null,null,null,null,null,null,null,null,null,null,null,null,null,{"$f":"$P$44","v":0.64},26.40144665461121]
[null,null,null,null,null,null,null,null,null,null,null,null,null,null,null,null,null,null,null,null,null,0.64,24.9757045675413]
[null,null,null,null,null,null,null,null,null,null,null,null,null,null,null,null,null,null,null,null,null,0.64,19.6113074204947]
[null,null,null,null,null,null,null,null,null,null,null,null,null,null,null,null,null,null,null,null,null,0.64,19.318387817995045]
[null,null,null,null,null,null,null,null,null,null,null,null,null,null,null,null,null,null,null,null,null,0.64,19.613075383589059]
[null,null,null,null,null,null,null,null,null,null,null,null,null,null,null,null,null,null,null,null,null,0.64,12.87313432835821]
[null,null,null,null,null,null,null,null,null,null,null,null,null,null,null,null,null,null,null,null,null,0.64,24.715504978662871]
[null,null,null,null,null,null,null,null,null,null,null,null,null,null,null,null,null,null,null,null,null,0.64,25.441906653426017]
[null,null,null,null,null,null,null,null,null,null,null,null,null,null,null,null,null,null,null,null,null,0.64,26.056338028169012]
[null,null,null,null,null,null,null,null,null,null,null,null,null,null,null,null,null,null,null,null,null,0.64,21.606188985080124]
[null,null,null,null,null,null,null,null,null,null,null,null,null,null,null,null,null,null,null,null,null,0.64,24.511400651465799]
[null,null,null,null,null,null,null,null,null,null,null,null,null,null,null,null,null,null,null,null,null,0.64,13.588390501319262]
[null,null,null,null,null,null,null,null,null,null,null,null,null,null,null,null,null,null,null,null,null,0.64,24.498656191854458]
[null,null,null,null,null,null,null,null,null,null,null,null,null,null,null,null,null,null,null,null,null,0.64,24.066047471620227]
[null,null,null,null,null,null,null,null,null,null,null,null,null,null,null,null,null,null,null,null,null,0.64,31.067961165048541]
[null,null,null,null,null,null,null,null,null,null,null,null,null,null,null,null,null,null,null,null,null,0.64,23.051627754028281]
[null,null,null,null,null,null,null,null,null,null,null,null,null,null,null,null,null,null,null,null,null,0.64,21.1781206171108]
[null,null,null,null,null,null,null,null,null,null,null,null,null,null,null,null,null,null,null,null,null,0.64,18.867924528301888]
[null,null,null,null,null,null,null,null,null,null,null,null,null,null,null,null,null,null,null,null,null,0.64,12.276214833759591]
[null,null,null,null,null,null,null,null,null,null,null,null,null,null,null,null,null,null,null,null,null,0.64,12.125984251968504]
[null,null,null,null,null,null,null,null,null,null,null,null,null,null,null,null,null,null,null,null,null,0.64,3.8961038961038961]
[null,null,null,null,null,null,null,null,null,null,null,null,null,null,null,null,null,null,null,null,null,0.64,9.1953131062310867]
[null,null,null,null,null,null,null,null,null,null,null,null,null,null,null,null,null,null,null,null,null,0.64,7.4935400516795871]
[null,null,null,null,null,null,null,null,null,null,null,null,null,null,null,null,null,null,null,null,null,0.64,5.0397877984084882]
[null,null,null,null,null,null,null,null,null,null,null,null,null,null,null,null,null,null,null,null,null,0.64,24.396161905812285]
[null,null,null,null,null,null,null,null,null,null,null,null,null,null,null,null,null,null,null,null,null,0.64,20.635775862068968]
[null,null,null,null,null,null,null,null,null,null,null,null,null,null,null,null,null,null,null,null,null,0.64,9.4882729211087415]
[null,null,null,null,null,null,null,null,null,null,null,null,null,null,null,null,null,null,null,null,null,0.64,17.846492636601365]
[null,null,null,null,null,null,null,null,null,null,null,null,null,null,null,null,null,null,null,null,null,0.64,18.125]
[null,null,null,null,null,null,null,null,null,null,null,null,null,null,null,null,null,null,null,null,null,0.64,9.932279909706546]
[null,null,null,null,null,null,null,null,null,null,null,null,null,null,null,null,null,null,null,null,null,0.64,25.089952947688904]
[null,null,null,null,null,null,null,null,null,null,null,null,null,null,null,null,null,null,null,null,null,0.64,22.738897930713787]
[null,null,null,null,null,null,null,null,null,null,null,null,null,null,null,null,null,null,null,null,null,0.64,20.24866785079929]
[null,null,null,null,null,null,null,null,null,null,null,null,null,null,null,null,null,null,null,null,null,0.64,19.041074373674704]
[null,null,null,null,null,null,null,null,null,null,null,null,null,null,null,null,null,null,null,null,null,0.64,19.154228855721392]
[null,null,null,null,null,null,null,null,null,null,null,null,null,null,null,null,null,null,null,null,null,0.64,10.16949152542373]
[null,null,null,null,null,null,null,null,null,null,null,null,null,null,null,null,null,null,null,null,null,0.64,21.563727240271334]
[null,null,null,null,null,null,null,null,null,null,null,null,null,null,null,null,null,null,null,null,null,0.64,20.127177218689521]
[null,null,null,null,null,null,null,null,null,null,null,null,null,null,null,null,null,null,null,null,null,0.64,19.219219219219219]
[null,null,null,null,null,null,null,null,null,null,null,null,null,null,null,null,null,null,null,null,null,0.64,21.395319967723918]
[null,null,null,null,null,null,null,null,null,null,null,null,null,null,null,null,null,null,null,null,null,0.64,20.843672456575682]
[null,null,null,null,null,null,null,null,null,null,null,null,null,null,null,null,null,null,null,null,null,0.64,12.232204561161023]
[null,null,null,null,null,null,null,null,null,null,null,null,null,null,null,null,null,null,null,null,null,0.64,21.793103448275865]
[null,null,null,null,null,null,null,null,null,null,null,null,null,null,null,null,null,null,null,null,null,0.64,22.21861822899773]
[null,null,null,null,null,null,null,null,null,null,null,null,null,null,null,null,null,null,null,null,null,0.64,28.517110266159694]
[null,null,null,null,null,null,null,null,null,null,null,null,null,null,null,null,null,null,null,null,null,0.64,23.263382336438109]
[null,null,null,null,null,null,null,null,null,null,null,null,null,null,null,null,null,null,null,null,null,0.64,22.356828193832598]
[null,null,null,null,null,null,null,null,null,null,null,null,null,null,null,null,null,null,null,null,null,0.64,19.402985074626866]
[null,null,null,null,null,null,null,null,null,null,null,null,null,null,null,null,null,null,null,null,null,0.64,{"$f":"G45","v":4.5997300384176096},"NRW"]
[null,null,null,null,null,null,null,null,null,null,null,null,null,null,null,null,null,null,null,null,null,0.64,{"$f":"G46","v":3.1243219787372531}]
[null,null,null,null,null,null,null,null,null,null,null,null,null,null,null,null,null,null,null,null,null,0.64,1.1650485436893203]
[null,null,null,null,null,null,null,null,null,null,null,null,null,null,null,null,null,null,null,null,null,0.64,5.7702020202020199]
[null,null,null,null,null,null,null,null,null,null,null,null,null,null,null,null,null,null,null,null,null,0.64,4.0919540229885056]
[null,null,null,null,null,null,null,null,null,null,null,null,null,null,null,null,null,null,null,null,null,0.64,{"$error":"#N/A"}]
[null,null,null,null,null,null,null,null,null,null,null,null,null,null,null,null,null,null,null,null,null,0.64,11.078919921195968]
[null,null,null,null,null,null,null,null,null,null,null,null,null,null,null,null,null,null,null,null,null,0.64,6.885056734406052]
[null,null,null,null,null,null,null,null,null,null,null,null,null,null,null,null,null,null,null,null,null,0.64,3.9332913782252987]
[null,null,null,null,null,null,null,null,null,null,null,null,null,null,null,null,null,null,null,null,null,0.64,10.71712093146335]
[null,null,null,null,null,null,null,null,null,null,null,null,null,null,null,null,null,null,null,null,null,0.64,7.9387186629526454]
[null,null,null,null,null,null,null,null,null,null,null,null,null,null,null,null,null,null,null,null,null,0.64,5.5194805194805197]
[null,null,null,null,null,null,null,null,null,null,null,null,null,null,null,null,null,null,null,null,null,0.64,12.431998573084812]
[null,null,null,null,null,null,null,null,null,null,null,null,null,null,null,null,null,null,null,null,null,0.64,9.0380270179318316]
[null,null,null,null,null,null,null,null,null,null,null,null,null,null,null,null,null,null,null,null,null,0.64,6.59869725290286]
[null,null,null,null,null,null,null,null,null,null,null,null,null,null,null,null,null,null,null,null,null,0.64,12.696934419868064]
[null,null,null,null,null,null,null,null,null,null,null,null,null,null,null,null,null,null,null,null,null,{"$f":"$P$44","v":0.64},9.9107788762961189]
[null,null,null,null,null,null,null,null,null,null,null,null,null,null,null,null,null,null,null,null,null,0.64,7.0583746661579543]
[null,null,null,null,null,null,null,null,null,null,null,null,null,null,null,null,null,null,null,null,null,0.64,14.38930432812146]
[null,null,null,null,null,null,null,null,null,null,null,null,null,null,null,null,null,null,null,null,null,0.64,11.114680372630904]
[null,null,null,null,null,null,null,null,null,null,null,null,null,null,null,null,null,null,null,null,null,0.64,10.139388489208633]
[null,null,null,null,null,null,null,null,null,null,null,null,null,null,null,null,null,null,null,null,null,0.64,13.230221430955824]
[null,null,null,null,null,null,null,null,null,null,null,null,null,null,null,null,null,null,null,null,null,0.64,11.200000000000001]
[null,null,null,null,null,null,null,null,null,null,null,null,null,null,null,null,null,null,null,null,null,0.64,9.5712861415752748]
[null,null,null,null,null,null,null,null,null,null,null,null,null,null,null,null,null,null,null,null,null,0.64,30.707610146862486]
[null,null,null,null,null,null,null,null,null,null,null,null,null,null,null,null,null,null,null,null,null,0.64,33.400491598501027]
[null,null,null,null,null,null,null,null,null,null,null,null,null,null,null,null,null,null,null,null,null,0.64,29.274924471299098]
[null,null,null,null,null,null,null,null,null,null,null,null,null,null,null,null,null,null,null,null,null,0.64,24.344493747478822]
[null,null,null,null,null,null,null,null,null,null,null,null,null,null,null,null,null,null,null,null,null,0.64,22.695924764890282]
[null,null,null,null,null,null,null,null,null,null,null,null,null,null,null,null,null,null,null,null,null,0.64,19.953051643192488]
[null,null,null,null,null,null,null,null,null,null,null,null,null,null,null,null,null,null,null,null,null,0.64,4.2367308595584783]
[null,null,null,null,null,null,null,null,null,null,null,null,null,null,null,null,null,null,null,null,null,0.64,2.8641823221435172]
[null,null,null,null,null,null,null,null,null,null,null,null,null,null,null,null,null,null,null,null,null,0.64,0.36014405762304924]
[null,null,null,null,null,null,null,null,null,null,null,null,null,null,null,null,null,null,null,null,null,0.64,5.8163980378416262]
[null,null,null,null,null,null,null,null,null,null,null,null,null,null,null,null,null,null,null,null,null,0.64,4.7648902821316614]
[null,null,null,null,null,null,null,null,null,null,null,null,null,null,null,null,null,null,null,null,null,0.64,{"$error":"#N/A"}]
[null,null,null,null,null,null,null,null,null,null,null,null,null,null,null,null,null,null,null,null,null,0.64,9.67741935483871]
[null,null,null,null,null,null,null,null,null,null,null,null,null,null,null,null,null,null,null,null,null,0.64,6.6943341753879464]
[null,null,null,null,null,null,null,null,null,null,null,null,null,null,null,null,null,null,null,null,null,0.64,2.9114935017788426]
[null,null,null,null,null,null,null,null,null,null,null,null,null,null,null,null,null,null,null,null,null,0.64,10.679951057507429]
[null,null,null,null,null,null,null,null,null,null,null,null,null,null,null,null,null,null,null,null,null,0.64,9.7702820587380064]
[null,null,null,null,null,null,null,null,null,null,null,null,null,null,null,null,null,null,null,null,null,0.64,7.4361820199778021]
[null,null,null,null,null,null,null,null,null,null,null,null,null,null,null,null,null,null,null,null,null,0.64,11.339600470035252]
[null,null,null,null,null,null,null,null,null,null,null,null,null,null,null,null,null,null,null,null,null,0.64,8.1345491877528833]
[null,null,null,null,null,null,null,null,null,null,null,null,null,null,null,null,null,null,null,null,null,0.64,6.5906362545018009]
[null,null,null,null,null,null,null,null,null,null,null,null,null,null,null,null,null,null,null,null,null,0.64,12.550966140755184]
[null,null,null,null,null,null,null,null,null,null,null,null,null,null,null,null,null,null,null,null,null,0.64,10.343481654957065]
[null,null,null,null,null,null,null,null,null,null,null,null,null,null,null,null,null,null,null,null,null,0.64,8.695652173913043]
[null,null,null,null,null,null,null,null,null,null,null,null,null,null,null,null,null,null,null,null,null,0.64,12.711979378646046]
[null,null,null,null,null,null,null,null,null,null,null,null,null,null,null,null,null,null,null,null,null,0.64,9.7524808942625754]
[null,null,null,null,null,null,null,null,null,null,null,null,null,null,null,null,null,null,null,null,null,0.64,7.4284511784511782]
[null,null,null,null,null,null,null,null,null,null,null,null,null,null,null,null,null,null,null,null,null,0.64,13.96085740913327]
[null,null,null,null,null,null,null,null,null,null,null,null,null,null,null,null,null,null,null,null,null,0.64,9.5693779904306222]
[null,null,null,null,null,null,null,null,null,null,null,null,null,null,null,null,null,null,null,null,null,0.64,8.6530612244897949]
[null,null,null,null,null,null,null,null,null,null,null,null,null,null,null,null,null,null,null,null,null,0.64,29.797504120555686]
[null,null,null,null,null,null,null,null,null,null,null,null,null,null,null,null,null,null,null,null,null,0.64,28.371857910941596]
[null,null,null,null,null,null,null,null,null,null,null,null,null,null,null,null,null,null,null,null,null,0.64,20.874704491725769]
[null,null,null,null,null,null,null,null,null,null,null,null,null,null,null,null,null,null,null,null,null,0.64,22.126324048646527]
[null,null,null,null,null,null,null,null,null,null,null,null,null,null,null,null,null,null,null,null,null,0.64,21.796407185628741]
[null,null,null,null,null,null,null,null,null,null,null,null,null,null,null,null,null,null,null,null,null,0.64,15.365239294710328]
[null,null,null,null,null,null,null,null,null,null,null,null,null,null,null,null,null,null,null,null,null,0.64,14.964488931345269]
[null,null,null,null,null,null,null,null,null,null,null,null,null,null,null,null,null,null,null,null,null,0.64,13.528336380255942]
[null,null,null,null,null,null,null,null,null,null,null,null,null,null,null,null,null,null,null,null,null,0.64,10.526315789473683]
[null,null,null,null,null,null,null,null,null,null,null,null,null,null,null,null,null,null,null,null,null,0.64,12.568956621820057]
[null,null,null,null,null,null,null,null,null,null,null,null,null,null,null,null,null,null,null,null,null,0.64,10.931174089068826]
[null,null,null,null,null,null,null,null,null,null,null,null,null,null,null,null,null,null,null,null,null,0.64,{"$f":"G110","v":13.596491228070176}]
[null,null,null,null,null,null,null,null,null,null,null,null,null,null,null,null,null,null,null,null,null,0.64,26.020428926057054]
[null,null,null,null,null,null,null,null,null,null,null,null,null,null,null,null,null,null,null,null,null,0.64,24.343902149388434]
[null,null,null,null,null,null,null,null,null,null,null,null,null,null,null,null,null,null,null,null,null,0.64,13.777490297542045]
[null,null,null,null,null,null,null,null,null,null,null,null,null,null,null,null,null,null,null,null,null,0.64,20.242049623061149]
[null,null,null,null,null,null,null,null,null,null,null,null,null,null,null,null,null,null,null,null,null,0.64,20.151770657672849]
[null,null,null,null,null,null,null,null,null,null,null,null,null,null,null,null,null,null,null,null,null,0.64,14.495114006514658]
[null,null,null,null,null,null,null,null,null,null,null,null,null,null,null,null,null,null,null,null,null,0.64,27.250650477016482]
[null,null,null,null,null,null,null,null,null,null,null,null,null,null,null,null,null,null,null,null,null,0.64,27.369151467089615]
[null,null,null,null,null,null,null,null,null,null,null,null,null,null,null,null,null,null,null,null,null,0.64,23.967684021543985]
[null,null,null,null,null,null,null,null,null,null,null,null,null,null,null,null,null,null,null,null,null,0.64,22.633662707522372]
[null,null,null,null,null,null,null,null,null,null,null,null,null,null,null,null,null,null,null,null,null,0.64,22.917375042502549]
[null,null,null,null,null,null,null,null,null,null,null,null,null,null,null,null,null,null,null,null,null,0.64,18.149081742888011]
[null,null,null,null,null,null,null,null,null,null,null,null,null,null,null,null,null,null,null,null,null,0.64,26.057658909343523]
[null,null,null,null,null,null,null,null,null,null,null,null,null,null,null,null,null,null,null,null,null,0.64,25.027553269654668]
[null,null,null,null,null,null,null,null,null,null,null,null,null,null,null,null,null,null,null,null,null,{"$f":"$P$44","v":0.64},27.849740932642487]
[null,null,null,null,null,null,null,null,null,null,null,null,null,null,null,null,null,null,null,null,null,0.64,24.603439241651976]
[null,null,null,null,null,null,null,null,null,null,null,null,null,null,null,null,null,null,null,null,null,0.64,23.986735445836405]
[null,null,null,null,null,null,null,null,null,null,null,null,null,null,null,null,null,null,null,null,null,0.64,19.900849858356938]
[null,null,null,null,null,null,null,null,null,null,null,null,null,null,null,null,null,null,null,null,null,0.64,24.090265634107752]
[null,null,null,null,null,null,null,null,null,null,null,null,null,null,null,null,null,null,null,null,null,0.64,25.350560897435898]
[null,null,null,null,null,null,null,null,null,null,null,null,null,null,null,null,null,null,null,null,null,0.64,32.223701731025301]
[null,null,null,null,null,null,null,null,null,null,null,null,null,null,null,null,null,null,null,null,null,0.64,26.962242047400199]
[null,null,null,null,null,null,null,null,null,null,null,null,null,null,null,null,null,null,null,null,null,0.64,28.742038216560513]
[null,null,null,null,null,null,null,null,null,null,null,null,null,null,null,null,null,null,null,null,null,0.64,27.194244604316548]
[null,null,null,null,null,null,null,null,null,null,null,null,null,null,null,null,null,null,null,null,null,0.64,14.503052747472726]
[null,null,null,null,null,null,null,null,null,null,null,null,null,null,null,null,null,null,null,null,null,0.64,13.420621931260229]
[null,null,null,null,null,null,null,null,null,null,null,null,null,null,null,null,null,null,null,null,null,0.64,9.3333333333333339]
[null,null,null,null,null,null,null,null,null,null,null,null,null,null,null,null,null,null,null,null,null,0.64,10.798823474485269]
[null,null,null,null,null,null,null,null,null,null,null,null,null,null,null,null,null,null,null,null,null,0.64,10.112359550561797]
[null,null,null,null,null,null,null,null,null,null,null,null,null,null,null,null,null,null,null,null,null,0.64,10.747663551401869]
[null,null,null,null,null,null,null,null,null,null,null,null,null,null,null,null,null,null,null,null,null,0.64,27.271857204383405]
[null,null,null,null,null,null,null,null,null,null,null,null,null,null,null,null,null,null,null,null,null,0.64,23.30472103004292]
[null,null,null,null,null,null,null,null,null,null,null,null,null,null,null,null,null,null,null,null,null,0.64,11.303827751196172]
[null,null,null,null,null,null,null,null,null,null,null,null,null,null,null,null,null,null,null,null,null,0.64,21.636173836602385]
[null,null,null,null,null,null,null,null,null,null,null,null,null,null,null,null,null,null,null,null,null,0.64,23.474968447623056]
[null,null,null,null,null,null,null,null,null,null,null,null,null,null,null,null,null,null,null,null,null,0.64,15.527401296405422]
[null,null,null,null,null,null,null,null,null,null,null,null,null,null,null,null,null,null,null,null,null,0.64,27.133012136366407]
[null,null,null,null,null,null,null,null,null,null,null,null,null,null,null,null,null,null,null,null,null,0.64,25.309541150764748]
[null,null,null,null,null,null,null,null,null,null,null,null,null,null,null,null,null,null,null,null,null,0.64,16.502242152466369]
[null,null,null,null,null,null,null,null,null,null,null,null,null,null,null,null,null,null,null,null,null,0.64,22.421152204508225]
[null,null,null,null,null,null,null,null,null,null,null,null,null,null,null,null,null,null,null,null,null,0.64,24.833836858006041]
[null,null,null,null,null,null,null,null,null,null,null,null,null,null,null,null,null,null,null,null,null,0.64,18.187619655392471]
[null,null,null,null,null,null,null,null,null,null,null,null,null,null,null,null,null,null,null,null,null,0.64,22.795078022960062]
[null,null,null,null,null,null,null,null,null,null,null,null,null,null,null,null,null,null,null,null,null,0.64,21.469072164948454]
[null,null,null,null,null,null,null,null,null,null,null,null,null,null,null,null,null,null,null,null,null,0.64,23.946037099494095]
[null,null,null,null,null,null,null,null,null,null,null,null,null,null,null,null,null,null,null,null,null,0.64,23.407221525163809]
[null,null,null,null,null,null,null,null,null,null,null,null,null,null,null,null,null,null,null,null,null,0.64,26.073736221968836]
[null,null,null,null,null,null,null,null,null,null,null,null,null,null,null,null,null,null,null,null,null,0.64,19.074598677998111]
[null,null,null,null,null,null,null,null,null,null,null,null,null,null,null,null,null,null,null,null,null,0.64,22.141680395387151]
[null,null,null,null,null,null,null,null,null,null,null,null,null,null,null,null,null,null,null,null,null,0.64,21.868070953436806]
[null,null,null,null,null,null,null,null,null,null,null,null,null,null,null,null,null,null,null,null,null,0.64,27.541589648798521]
[null,null,null,null,null,null,null,null,null,null,null,null,null,null,null,null,null,null,null,null,null,0.64,25.904683872729755]
[null,null,null,null,null,null,null,null,null,null,null,null,null,null,null,null,null,null,null,null,null,0.64,33.164983164983163]
[null,null,null,null,null,null,null,null,null,null,null,null,null,null,null,null,null,null,null,null,null,0.64,26.525821596244132]
[null,null,null,null,null,null,null,null,null,null,null,null,null,null,null,null,null,null,null,null,null,0.64,{"$f":"H45","v":3.8536704531574451},"ND"]
[null,null,null,null,null,null,null,null,null,null,null,null,null,null,null,null,null,null,null,null,null,0.64,{"$f":"H46","v":2.9881903853035907}]
[null,null,null,null,null,null,null,null,null,null,null,null,null,null,null,null,null,null,null,null,null,0.64,0.77519379844961245]
[null,null,null,null,null,null,null,null,null,null,null,null,null,null,null,null,null,null,null,null,null,0.64,4.6576237947377024]
[null,null,null,null,null,null,null,null,null,null,null,null,null,null,null,null,null,null,null,null,null,0.64,3.8952745849297572]
[null,null,null,null,null,null,null,null,null,null,null,null,null,null,null,null,null,null,null,null,null,0.64,{"$error":"#N/A"}]
[null,null,null,null,null,null,null,null,null,null,null,null,null,null,null,null,null,null,null,null,null,0.64,9.9623627006682529]
[null,null,null,null,null,null,null,null,null,null,null,null,null,null,null,null,null,null,null,null,null,0.64,6.0586580956207312]
[null,null,null,null,null,null,null,null,null,null,null,null,null,null,null,null,null,null,null,null,null,0.64,4.4834819087572102]
[null,null,null,null,null,null,null,null,null,null,null,null,null,null,null,null,null,null,null,null,null,0.64,9.1631032376298105]
[null,null,null,null,null,null,null,null,null,null,null,null,null,null,null,null,null,null,null,null,null,0.64,6.8872180451127818]
[null,null,null,null,null,null,null,null,null,null,null,null,null,null,null,null,null,null,null,null,null,0.64,6.5399911621741049]
[null,null,null,null,null,null,null,null,null,null,null,null,null,null,null,null,null,null,null,null,null,0.64,11.079642007477059]
[null,null,null,null,null,null,null,null,null,null,null,null,null,null,null,null,null,null,null,null,null,0.64,7.9368917366862117]
[null,null,null,null,null,null,null,null,null,null,null,null,null,null,null,null,null,null,null,null,null,0.64,7.18954248366013]
[null,null,null,null,null,null,null,null,null,null,null,null,null,null,null,null,null,null,null,null,null,0.64,9.755542922114838]
[null,null,null,null,null,null,null,null,null,null,null,null,null,null,null,null,null,null,null,null,null,0.64,9.3591516828031356]
[null,null,null,null,null,null,null,null,null,null,null,null,null,null,null,null,null,null,null,null,null,0.64,6.7061143984220903]
[null,null,null,null,null,null,null,null,null,null,null,null,null,null,null,null,null,null,null,null,null,0.64,11.217452498240675]
[null,null,null,null,null,null,null,null,null,null,null,null,null,null,null,null,null,null,null,null,null,0.64,8.9755272064566523]
[null,null,null,null,null,null,null,null,null,null,null,null,null,null,null,null,null,null,null,null,null,0.64,9.1270894136375702]
[null,null,null,null,null,null,null,null,null,null,null,null,null,null,null,null,null,null,null,null,null,0.64,9.691786923213968]
[null,null,null,null,null,null,null,null,null,null,null,null,null,null,null,null,null,null,null,null,null,0.64,9.8970251716247137]
[null,null,null,null,null,null,null,null,null,null,null,null,null,null,null,null,null,null,null,null,null,0.64,8.695652173913043]
[null,null,null,null,null,null,null,null,null,null,null,null,null,null,null,null,null,null,null,null,null,{"$f":"$P$44","v":0.64},23.94908921064923]
[null,null,null,null,null,null,null,null,null,null,null,null,null,null,null,null,null,null,null,null,null,0.64,26.514703510563947]
[null,null,null,null,null,null,null,null,null,null,null,null,null,null,null,null,null,null,null,null,null,0.64,25.51117905599083]
[null,null,null,null,null,null,null,null,null,null,null,null,null,null,null,null,null,null,null,null,null,0.64,16.173972137274887]
[null,null,null,null,null,null,null,null,null,null,null,null,null,null,null,null,null,null,null,null,null,0.64,17.446808510638299]
[null,null,null,null,null,null,null,null,null,null,null,null,null,null,null,null,null,null,null,null,null,0.64,18.927444794952681]
[null,null,null,null,null,null,null,null,null,null,null,null,null,null,null,null,null,null,null,null,null,0.64,3.2502366677185228]
[null,null,null,null,null,null,null,null,null,null,null,null,null,null,null,null,null,null,null,null,null,0.64,2.2854750941816659]
[null,null,null,null,null,null,null,null,null,null,null,null,null,null,null,null,null,null,null,null,null,0.64,1.6824395373291272]
[null,null,null,null,null,null,null,null,null,null,null,null,null,null,null,null,null,null,null,null,null,0.64,3.755656108597285]
[null,null,null,null,null,null,null,null,null,null,null,null,null,null,null,null,null,null,null,null,null,0.64,4.6087888531618439]
[null,null,null,null,null,null,null,null,null,null,null,null,null,null,null,null,null,null,null,null,null,0.64,2.6548672566371683]
[null,null,null,null,null,null,null,null,null,null,null,null,null,null,null,null,null,null,null,null,null,0.64,8.8584749586403966]
[null,null,null,null,null,null,null,null,null,null,null,null,null,null,null,null,null,null,null,null,null,0.64,6.3091989083319948]
[null,null,null,null,null,null,null,null,null,null,null,null,null,null,null,null,null,null,null,null,null,0.64,3.1777737425095336]
[null,null,null,null,null,null,null,null,null,null,null,null,null,null,null,null,null,null,null,null,null,0.64,9.0135312090790052]
[null,null,null,null,null,null,null,null,null,null,null,null,null,null,null,null,null,null,null,null,null,0.64,8.0637132901941264]
[null,null,null,null,null,null,null,null,null,null,null,null,null,null,null,null,null,null,null,null,null,0.64,7.0781616907078169]
[null,null,null,null,null,null,null,null,null,null,null,null,null,null,null,null,null,null,null,null,null,0.64,8.3821701296394959]
[null,null,null,null,null,null,null,null,null,null,null,null,null,null,null,null,null,null,null,null,null,0.64,6.7284586337109511]
[null,null,null,null,null,null,null,null,null,null,null,null,null,null,null,null,null,null,null,null,null,0.64,6.3965306952161542]
[null,null,null,null,null,null,null,null,null,null,null,null,null,null,null,null,null,null,null,null,null,0.64,11.082291912284839]
[null,null,null,null,null,null,null,null,null,null,null,null,null,null,null,null,null,null,null,null,null,0.64,8.1476766390833859]
[null,null,null,null,null,null,null,null,null,null,null,null,null,null,null,null,null,null,null,null,null,0.64,7.2353389185072352]
[null,null,null,null,null,null,null,null,null,null,null,null,null,null,null,null,null,null,null,null,null,0.64,8.8139987038237191]
[null,null,null,null,null,null,null,null,null,null,null,null,null,null,null,null,null,null,null,null,null,0.64,7.4403250380904007]
[null,null,null,null,null,null,null,null,null,null,null,null,null,null,null,null,null,null,null,null,null,0.64,7.2244289970208539]
[null,null,null,null,null,null,null,null,null,null,null,null,null,null,null,null,null,null,null,null,null,0.64,9.8279457768508873]
[null,null,null,null,null,null,null,null,null,null,null,null,null,null,null,null,null,null,null,null,null,0.64,8.0903790087463552]
[null,null,null,null,null,null,null,null,null,null,null,null,null,null,null,null,null,null,null,null,null,0.64,9.4866071428571423]
[null,null,null,null,null,null,null,null,null,null,null,null,null,null,null,null,null,null,null,null,null,0.64,22.273024167210973]
[null,null,null,null,null,null,null,null,null,null,null,null,null,null,null,null,null,null,null,null,null,0.64,22.054817368099183]
[null,null,null,null,null,null,null,null,null,null,null,null,null,null,null,null,null,null,null,null,null,0.64,17.95351322468608]
[null,null,null,null,null,null,null,null,null,null,null,null,null,null,null,null,null,null,null,null,null,0.64,19.228619340413637]
[null,null,null,null,null,null,null,null,null,null,null,null,null,null,null,null,null,null,null,null,null,0.64,17.164179104477611]
[null,null,null,null,null,null,null,null,null,null,null,null,null,null,null,null,null,null,null,null,null,0.64,13.87900355871886]
[null,null,null,null,null,null,null,null,null,null,null,null,null,null,null,null,null,null,null,null,null,0.64,12.994115199429352]
[null,null,null,null,null,null,null,null,null,null,null,null,null,null,null,null,null,null,null,null,null,0.64,11.056511056511056]
[null,null,null,null,null,null,null,null,null,null,null,null,null,null,null,null,null,null,null,null,null,0.64,4.4943820224719104]
[null,null,null,null,null,null,null,null,null,null,null,null,null,null,null,null,null,null,null,null,null,0.64,9.2964144719052513]
[null,null,null,null,null,null,null,null,null,null,null,null,null,null,null,null,null,null,null,null,null,0.64,8.9285714285714288]
[null,null,null,null,null,null,null,null,null,null,null,null,null,null,null,null,null,null,null,null,null,0.64,{"$f":"H110","v":6.9565217391304346}]
[null,null,null,null,null,null,null,null,null,null,null,null,null,null,null,null,null,null,null,null,null,0.64,24.338686131386861]
[null,null,null,null,null,null,null,null,null,null,null,null,null,null,null,null,null,null,null,null,null,0.64,20.951286104325334]
[null,null,null,null,null,null,null,null,null,null,null,null,null,null,null,null,null,null,null,null,null,0.64,10.457516339869281]
[null,null,null,null,null,null,null,null,null,null,null,null,null,null,null,null,null,null,null,null,null,0.64,18.110373733845616]
[null,null,null,null,null,null,null,null,null,null,null,null,null,null,null,null,null,null,null,null,null,0.64,19.570011025358326]
[null,null,null,null,null,null,null,null,null,null,null,null,null,null,null,null,null,null,null,null,null,0.64,13.525179856115107]
[null,null,null,null,null,null,null,null,null,null,null,null,null,null,null,null,null,null,null,null,null,0.64,26.778207499579622]
[null,null,null,null,null,null,null,null,null,null,null,null,null,null,null,null,null,null,null,null,null,0.64,23.333756506284118]
[null,null,null,null,null,null,null,null,null,null,null,null,null,null,null,null,null,null,null,null,null,0.64,19.957761351636748]
[null,null,null,null,null,null,null,null,null,null,null,null,null,null,null,null,null,null,null,null,null,0.64,20.449997559666162]
[null,null,null,null,null,null,null,null,null,null,null,null,null,null,null,null,null,null,null,null,null,0.64,23.275434243176178]
[null,null,null,null,null,null,null,null,null,null,null,null,null,null,null,null,null,null,null,null,null,0.64,18.440036068530208]
[null,null,null,null,null,null,null,null,null,null,null,null,null,null,null,null,null,null,null,null,null,0.64,22.98673248997223]
[null,null,null,null,null,null,null,null,null,null,null,null,null,null,null,null,null,null,null,null,null,0.64,22.835105761364964]
[null,null,null,null,null,null,null,null,null,null,null,null,null,null,null,null,null,null,null,null,null,0.64,23.294723294723294]
[null,null,null,null,null,null,null,null,null,null,null,null,null,null,null,null,null,null,null,null,null,0.64,22.699939867708959]
[null,null,null,null,null,null,null,null,null,null,null,null,null,null,null,null,null,null,null,null,null,0.64,26.116838487972512]
[null,null,null,null,null,null,null,null,null,null,null,null,null,null,null,null,null,null,null,null,null,0.64,20.845341018251681]
[null,null,null,null,null,null,null,null,null,null,null,null,null,null,null,null,null,null,null,null,null,0.64,22.488938053097346]
[null,null,null,null,null,null,null,null,null,null,null,null,null,null,null,null,null,null,null,null,null,0.64,24.981853375272202]
[null,null,null,null,null,null,null,null,null,null,null,null,null,null,null,null,null,null,null,null,null,0.64,28.338278931750743]
[null,null,null,null,null,null,null,null,null,null,null,null,null,null,null,null,null,null,null,null,null,0.64,24.240844519744559]
[null,null,null,null,null,null,null,null,null,null,null,null,null,null,null,null,null,null,null,null,null,{"$f":"$P$44","v":0.64},28.125]
[null,null,null,null,null,null,null,null,null,null,null,null,null,null,null,null,null,null,null,null,null,0.64,28.030303030303028]
[null,null,null,null,null,null,null,null,null,null,null,null,null,null,null,null,null,null,null,null,null,0.64,12.397321736729481]
[null,null,null,null,null,null,null,null,null,null,null,null,null,null,null,null,null,null,null,null,null,0.64,8.6700955180014692]
[null,null,null,null,null,null,null,null,null,null,null,null,null,null,null,null,null,null,null,null,null,0.64,4.9450549450549453]
[null,null,null,null,null,null,null,null,null,null,null,null,null,null,null,null,null,null,null,null,null,0.64,7.5263259900510375]
[null,null,null,null,null,null,null,null,null,null,null,null,null,null,null,null,null,null,null,null,null,0.64,10.102489019033674]
[null,null,null,null,null,null,null,null,null,null,null,null,null,null,null,null,null,null,null,null,null,0.64,8.2077051926298168]
[null,null,null,null,null,null,null,null,null,null,null,null,null,null,null,null,null,null,null,null,null,0.64,24.927174365376612]
[null,null,null,null,null,null,null,null,null,null,null,null,null,null,null,null,null,null,null,null,null,0.64,20.071509832601983]
[null,null,null,null,null,null,null,null,null,null,null,null,null,null,null,null,null,null,null,null,null,0.64,9.5604395604395602]
[null,null,null,null,null,null,null,null,null,null,null,null,null,null,null,null,null,null,null,null,null,0.64,17.864685177942903]
[null,null,null,null,null,null,null,null,null,null,null,null,null,null,null,null,null,null,null,null,null,0.64,25.82599118942731]
[null,null,null,null,null,null,null,null,null,null,null,null,null,null,null,null,null,null,null,null,null,0.64,17.818407189339943]
[null,null,null,null,null,null,null,null,null,null,null,null,null,null,null,null,null,null,null,null,null,0.64,24.235747727898652]
[null,null,null,null,null,null,null,null,null,null,null,null,null,null,null,null,null,null,null,null,null,0.64,21.818181818181817]
[null,null,null,null,null,null,null,null,null,null,null,null,null,null,null,null,null,null,null,null,null,0.64,17.664670658682635]
[null,null,null,null,null,null,null,null,null,null,null,null,null,null,null,null,null,null,null,null,null,0.64,19.466498355645616]
[null,null,null,null,null,null,null,null,null,null,null,null,null,null,null,null,null,null,null,null,null,0.64,24.863685932388222]
[null,null,null,null,null,null,null,null,null,null,null,null,null,null,null,null,null,null,null,null,null,0.64,21.372740595994138]
[null,null,null,null,null,null,null,null,null,null,null,null,null,null,null,null,null,null,null,null,null,0.64,19.030720876001219]
[null,null,null,null,null,null,null,null,null,null,null,null,null,null,null,null,null,null,null,null,null,0.64,17.951070336391435]
[null,null,null,null,null,null,null,null,null,null,null,null,null,null,null,null,null,null,null,null,null,0.64,18.87905604719764]
[null,null,null,null,null,null,null,null,null,null,null,null,null,null,null,null,null,null,null,null,null,0.64,20.611077048845289]
[null,null,null,null,null,null,null,null,null,null,null,null,null,null,null,null,null,null,null,null,null,0.64,22.412993039443155]
[null,null,null,null,null,null,null,null,null,null,null,null,null,null,null,null,null,null,null,null,null,0.64,20.224719101123593]
[null,null,null,null,null,null,null,null,null,null,null,null,null,null,null,null,null,null,null,null,null,0.64,19.059939629150495]
[null,null,null,null,null,null,null,null,null,null,null,null,null,null,null,null,null,null,null,null,null,0.64,19.202034652678428]
[null,null,null,null,null,null,null,null,null,null,null,null,null,null,null,null,null,null,null,null,null,0.64,27.399650959860384]
[null,null,null,null,null,null,null,null,null,null,null,null,null,null,null,null,null,null,null,null,null,0.64,21.493834826576776]
[null,null,null,null,null,null,null,null,null,null,null,null,null,null,null,null,null,null,null,null,null,0.64,32.837301587301589]
[null,null,null,null,null,null,null,null,null,null,null,null,null,null,null,null,null,null,null,null,null,0.64,28.167281672816731]
[null,null,null,null,null,null,null,null,null,null,null,null,null,null,null,null,null,null,null,null,null,0.64,{"$f":"I45","v":5.7201435161455665},"OD"]
[null,null,null,null,null,null,null,null,null,null,null,null,null,null,null,null,null,null,null,null,null,0.64,{"$f":"I46","v":3.8923267326732671}]
[null,null,null,null,null,null,null,null,null,null,null,null,null,null,null,null,null,null,null,null,null,0.64,1.6574585635359116]
[null,null,null,null,null,null,null,null,null,null,null,null,null,null,null,null,null,null,null,null,null,0.64,5.5036757401152396]
[null,null,null,null,null,null,null,null,null,null,null,null,null,null,null,null,null,null,null,null,null,0.64,3.9488966318234611]
[null,null,null,null,null,null,null,null,null,null,null,null,null,null,null,null,null,null,null,null,null,0.64,{"$error":"#N/A"}]
[null,null,null,null,null,null,null,null,null,null,null,null,null,null,null,null,null,null,null,null,null,0.64,11.670049289649173]
[null,null,null,null,null,null,null,null,null,null,null,null,null,null,null,null,null,null,null,null,null,0.64,7.1708191563311745]
[null,null,null,null,null,null,null,null,null,null,null,null,null,null,null,null,null,null,null,null,null,0.64,4.8333911836167998]
[null,null,null,null,null,null,null,null,null,null,null,null,null,null,null,null,null,null,null,null,null,0.64,9.2602543435428988]
[null,null,null,null,null,null,null,null,null,null,null,null,null,null,null,null,null,null,null,null,null,0.64,7.203718048024788]
[null,null,null,null,null,null,null,null,null,null,null,null,null,null,null,null,null,null,null,null,null,0.64,6.5533053114252962]
[null,null,null,null,null,null,null,null,null,null,null,null,null,null,null,null,null,null,null,null,null,0.64,12.743451981195433]
[null,null,null,null,null,null,null,null,null,null,null,null,null,null,null,null,null,null,null,null,null,0.64,8.5395051875498798]
[null,null,null,null,null,null,null,null,null,null,null,null,null,null,null,null,null,null,null,null,null,0.64,6.2101910828025479]
[null,null,null,null,null,null,null,null,null,null,null,null,null,null,null,null,null,null,null,null,null,0.64,11.380924517261557]
[null,null,null,null,null,null,null,null,null,null,null,null,null,null,null,null,null,null,null,null,null,0.64,9.8737601442741205]
[null,null,null,null,null,null,null,null,null,null,null,null,null,null,null,null,null,null,null,null,null,0.64,8.1794195250659634]
[null,null,null,null,null,null,null,null,null,null,null,null,null,null,null,null,null,null,null,null,null,0.64,12.386754139331458]
[null,null,null,null,null,null,null,null,null,null,null,null,null,null,null,null,null,null,null,null,null,0.64,10.265138620976588]
[null,null,null,null,null,null,null,null,null,null,null,null,null,null,null,null,null,null,null,null,null,0.64,8.8182001207972629]
[null,null,null,null,null,null,null,null,null,null,null,null,null,null,null,null,null,null,null,null,null,0.64,12.779552715654951]
[null,null,null,null,null,null,null,null,null,null,null,null,null,null,null,null,null,null,null,null,null,0.64,11.912034208918755]
[null,null,null,null,null,null,null,null,null,null,null,null,null,null,null,null,null,null,null,null,null,0.64,11.29177958446251]
[null,null,null,null,null,null,null,null,null,null,null,null,null,null,null,null,null,null,null,null,null,0.64,21.834429269937615]
[null,null,null,null,null,null,null,null,null,null,null,null,null,null,null,null,null,null,null,null,null,0.64,23.695873592644588]
[null,null,null,null,null,null,null,null,null,null,null,null,null,null,null,null,null,null,null,null,null,0.64,25.487300649734202]
[null,null,null,null,null,null,null,null,null,null,null,null,null,null,null,null,null,null,null,null,null,0.64,19.871159563924678]
[null,null,null,null,null,null,null,null,null,null,null,null,null,null,null,null,null,null,null,null,null,0.64,19.052523171987641]
[null,null,null,null,null,null,null,null,null,null,null,null,null,null,null,null,null,null,null,null,null,0.64,14.602587800369685]
[null,null,null,null,null,null,null,null,null,null,null,null,null,null,null,null,null,null,null,null,null,0.64,4.8871527777777777]
[null,null,null,null,null,null,null,null,null,null,null,null,null,null,null,null,null,null,null,null,null,0.64,3.3920360891819206]
[null,null,null,null,null,null,null,null,null,null,null,null,null,null,null,null,null,null,null,null,null,{"$f":"$P$44","v":0.64},0.94966761633428298]
[null,null,null,null,null,null,null,null,null,null,null,null,null,null,null,null,null,null,null,null,null,0.64,5.0167224080267561]
[null,null,null,null,null,null,null,null,null,null,null,null,null,null,null,null,null,null,null,null,null,0.64,4.666666666666667]
[null,null,null,null,null,null,null,null,null,null,null,null,null,null,null,null,null,null,null,null,null,0.64,2.464788732394366]
[null,null,null,null,null,null,null,null,null,null,null,null,null,null,null,null,null,null,null,null,null,0.64,9.0212876427829691]
[null,null,null,null,null,null,null,null,null,null,null,null,null,null,null,null,null,null,null,null,null,0.64,5.9159453912733113]
[null,null,null,null,null,null,null,null,null,null,null,null,null,null,null,null,null,null,null,null,null,0.64,3.6285362853628538]
[null,null,null,null,null,null,null,null,null,null,null,null,null,null,null,null,null,null,null,null,null,0.64,9.1259931895573221]
[null,null,null,null,null,null,null,null,null,null,null,null,null,null,null,null,null,null,null,null,null,0.64,9.2158859470468446]
[null,null,null,null,null,null,null,null,null,null,null,null,null,null,null,null,null,null,null,null,null,0.64,6.3955950868276155]
[null,null,null,null,null,null,null,null,null,null,null,null,null,null,null,null,null,null,null,null,null,0.64,9.8107494322482971]
[null,null,null,null,null,null,null,null,null,null,null,null,null,null,null,null,null,null,null,null,null,0.64,6.8867854214802113]
[null,null,null,null,null,null,null,null,null,null,null,null,null,null,null,null,null,null,null,null,null,0.64,5.7105108631826189]
[null,null,null,null,null,null,null,null,null,null,null,null,null,null,null,null,null,null,null,null,null,0.64,10.784851811196488]
[null,null,null,null,null,null,null,null,null,null,null,null,null,null,null,null,null,null,null,null,null,0.64,9.9890829694323138]
[null,null,null,null,null,null,null,null,null,null,null,null,null,null,null,null,null,null,null,null,null,0.64,8.4146817649355725]
[null,null,null,null,null,null,null,null,null,null,null,null,null,null,null,null,null,null,null,null,null,0.64,10.868555503947979]
[null,null,null,null,null,null,null,null,null,null,null,null,null,null,null,null,null,null,null,null,null,0.64,8.5789006678186155]
[null,null,null,null,null,null,null,null,null,null,null,null,null,null,null,null,null,null,null,null,null,0.64,6.6538930499912912]
[null,null,null,null,null,null,null,null,null,null,null,null,null,null,null,null,null,null,null,null,null,0.64,13.367609254498714]
[null,null,null,null,null,null,null,null,null,null,null,null,null,null,null,null,null,null,null,null,null,0.64,10.213940648723257]
[null,null,null,null,null,null,null,null,null,null,null,null,null,null,null,null,null,null,null,null,null,0.64,9.1895341416719845]
[null,null,null,null,null,null,null,null,null,null,null,null,null,null,null,null,null,null,null,null,null,0.64,21.213991769547324]
[null,null,null,null,null,null,null,null,null,null,null,null,null,null,null,null,null,null,null,null,null,0.64,23.73631652997495]
[null,null,null,null,null,null,null,null,null,null,null,null,null,null,null,null,null,null,null,null,null,0.64,22.354043084608179]
[null,null,null,null,null,null,null,null,null,null,null,null,null,null,null,null,null,null,null,null,null,0.64,19.362745098039216]
[null,null,null,null,null,null,null,null,null,null,null,null,null,null,null,null,null,null,null,null,null,0.64,18.198529411764707]
[null,null,null,null,null,null,null,null,null,null,null,null,null,null,null,null,null,null,null,null,null,0.64,19.144144144144143]
[null,null,null,null,null,null,null,null,null,null,null,null,null,null,null,null,null,null,null,null,null,0.64,14.871406322347097]
[null,null,null,null,null,null,null,null,null,null,null,null,null,null,null,null,null,null,null,null,null,0.64,14.207650273224044]
[null,null,null,null,null,null,null,null,null,null,null,null,null,null,null,null,null,null,null,null,null,0.64,6.6265060240963862]
[null,null,null,null,null,null,null,null,null,null,null,null,null,null,null,null,null,null,null,null,null,0.64,8.6266426178819895]
[null,null,null,null,null,null,null,null,null,null,null,null,null,null,null,null,null,null,null,null,null,0.64,12.170385395537526]
[null,null,null,null,null,null,null,null,null,null,null,null,null,null,null,null,null,null,null,null,null,0.64,{"$f":"I110","v":7.9646017699115044}]
[null,null,null,null,null,null,null,null,null,null,null,null,null,null,null,null,null,null,null,null,null,0.64,24.602661245610793]
[null,null,null,null,null,null,null,null,null,null,null,null,null,null,null,null,null,null,null,null,null,0.64,22.285992217898833]
[null,null,null,null,null,null,null,null,null,null,null,null,null,null,null,null,null,null,null,null,null,0.64,12.713035467526485]
[null,null,null,null,null,null,null,null,null,null,null,null,null,null,null,null,null,null,null,null,null,0.64,16.200545702592088]
[null,null,null,null,null,null,null,null,null,null,null,null,null,null,null,null,null,null,null,null,null,0.64,19.550930996714129]
[null,null,null,null,null,null,null,null,null,null,null,null,null,null,null,null,null,null,null,null,null,0.64,12.762818148284765]
[null,null,null,null,null,null,null,null,null,null,null,null,null,null,null,null,null,null,null,null,null,0.64,26.85662644197544]
[null,null,null,null,null,null,null,null,null,null,null,null,null,null,null,null,null,null,null,null,null,0.64,25.609826422928322]
[null,null,null,null,null,null,null,null,null,null,null,null,null,null,null,null,null,null,null,null,null,0.64,19.185360094451003]
[null,null,null,null,null,null,null,null,null,null,null,null,null,null,null,null,null,null,null,null,null,0.64,17.897091722595079]
[null,null,null,null,null,null,null,null,null,null,null,null,null,null,null,null,null,null,null,null,null,0.64,21.77570093457944]
[null,null,null,null,null,null,null,null,null,null,null,null,null,null,null,null,null,null,null,null,null,0.64,15.710723192019952]
[null,null,null,null,null,null,null,null,null,null,null,null,null,null,null,null,null,null,null,null,null,0.64,23.062470643494599]
[null,null,null,null,null,null,null,null,null,null,null,null,null,null,null,null,null,null,null,null,null,0.64,23.781485116126923]
[null,null,null,null,null,null,null,null,null,null,null,null,null,null,null,null,null,null,null,null,null,0.64,26.158599382080329]
[null,null,null,null,null,null,null,null,null,null,null,null,null,null,null,null,null,null,null,null,null,0.64,19.713449853724402]
[null,null,null,null,null,null,null,null,null,null,null,null,null,null,null,null,null,null,null,null,null,0.64,22.313596491228072]
[null,null,null,null,null,null,null,null,null,null,null,null,null,null,null,null,null,null,null,null,null,0.64,19.213649851632049]
[null,null,null,null,null,null,null,null,null,null,null,null,null,null,null,null,null,null,null,null,null,0.64,20.361947159585796]
[null,null,null,null,null,null,null,null,null,null,null,null,null,null,null,null,null,null,null,null,null,0.64,22.695522267533409]
[null,null,null,null,null,null,null,null,null,null,null,null,null,null,null,null,null,null,null,null,null,0.64,24.980842911877392]
[null,null,null,null,null,null,null,null,null,null,null,null,null,null,null,null,null,null,null,null,null,0.64,19.995286909390835]
[null,null,null,null,null,null,null,null,null,null,null,null,null,null,null,null,null,null,null,null,null,0.64,24.357034795763994]
[null,null,null,null,null,null,null,null,null,null,null,null,null,null,null,null,null,null,null,null,null,0.64,22.415795586527292]
[null,null,null,null,null,null,null,null,null,null,null,null,null,null,null,null,null,null,null,null,null,0.64,12.935464102201481]
[null,null,null,null,null,null,null,null,null,null,null,null,null,null,null,null,null,null,null,null,null,0.64,11.224489795918368]
[null,null,null,null,null,null,null,null,null,null,null,null,null,null,null,null,null,null,null,null,null,0.64,5.6047197640117989]
[null,null,null,null,null,null,null,null,null,null,null,null,null,null,null,null,null,null,null,null,null,0.64,6.6451043810643924]
[null,null,null,null,null,null,null,null,null,null,null,null,null,null,null,null,null,null,null,null,null,0.64,9.5238095238095237]
[null,null,null,null,null,null,null,null,null,null,null,null,null,null,null,null,null,null,null,null,null,0.64,8.1045751633986924]
[null,null,null,null,null,null,null,null,null,null,null,null,null,null,null,null,null,null,null,null,null,{"$f":"$P$44","v":0.64},23.197643277986074]
[null,null,null,null,null,null,null,null,null,null,null,null,null,null,null,null,null,null,null,null,null,0.64,20.504980767334057]
[null,null,null,null,null,null,null,null,null,null,null,null,null,null,null,null,null,null,null,null,null,0.64,9.7994702989027633]
[null,null,null,null,null,null,null,null,null,null,null,null,null,null,null,null,null,null,null,null,null,0.64,14.023434838885482]
[null,null,null,null,null,null,null,null,null,null,null,null,null,null,null,null,null,null,null,null,null,0.64,19.120065789473685]
[null,null,null,null,null,null,null,null,null,null,null,null,null,null,null,null,null,null,null,null,null,0.64,13.371598639455781]
[null,null,null,null,null,null,null,null,null,null,null,null,null,null,null,null,null,null,null,null,null,0.64,23.298731257208765]
[null,null,null,null,null,null,null,null,null,null,null,null,null,null,null,null,null,null,null,null,null,0.64,21.82741116751269]
[null,null,null,null,null,null,null,null,null,null,null,null,null,null,null,null,null,null,null,null,null,0.64,15.207823960880196]
[null,null,null,null,null,null,null,null,null,null,null,null,null,null,null,null,null,null,null,null,null,0.64,15.194851626742938]
[null,null,null,null,null,null,null,null,null,null,null,null,null,null,null,null,null,null,null,null,null,0.64,21.013877088643444]
[null,null,null,null,null,null,null,null,null,null,null,null,null,null,null,null,null,null,null,null,null,0.64,14.224063524943897]
[null,null,null,null,null,null,null,null,null,null,null,null,null,null,null,null,null,null,null,null,null,0.64,18.478144704499304]
[null,null,null,null,null,null,null,null,null,null,null,null,null,null,null,null,null,null,null,null,null,0.64,19.30779277318241]
[null,null,null,null,null,null,null,null,null,null,null,null,null,null,null,null,null,null,null,null,null,0.64,18.525703200775943]
[null,null,null,null,null,null,null,null,null,null,null,null,null,null,null,null,null,null,null,null,null,0.64,15.884959837503462]
[null,null,null,null,null,null,null,null,null,null,null,null,null,null,null,null,null,null,null,null,null,0.64,23.475177304964539]
[null,null,null,null,null,null,null,null,null,null,null,null,null,null,null,null,null,null,null,null,null,0.64,17.359709325797333]
[null,null,null,null,null,null,null,null,null,null,null,null,null,null,null,null,null,null,null,null,null,0.64,18.298885402012768]
[null,null,null,null,null,null,null,null,null,null,null,null,null,null,null,null,null,null,null,null,null,0.64,21.422962148578609]
[null,null,null,null,null,null,null,null,null,null,null,null,null,null,null,null,null,null,null,null,null,0.64,22.282120395327944]
[null,null,null,null,null,null,null,null,null,null,null,null,null,null,null,null,null,null,null,null,null,0.64,16.537108256280174]
[null,null,null,null,null,null,null,null,null,null,null,null,null,null,null,null,null,null,null,null,null,0.64,32.480314960629919]
[null,null,null,null,null,null,null,null,null,null,null,null,null,null,null,null,null,null,null,null,null,0.64,22.036727879799667]

{"sheet":"Merkmale","index":9,"n_rows":40,"n_cols":15,"rows_kept":40,"cut":false,"hidden":true,"merged":[]}
["Region1",{"$f":"Steuer!B3","v":"BA"},null,null,null,null,null,null,null,null,null,"Daten",{"$f":"Steuer!M6","v":5}]
["Diagramm Berufsausbildung"]
["CB_RK","CB_Geschl","CB_Alter","CB_Staat","CB_BAB"]
[2,3,4,5,6]
[null,null,null,null,"Insgesamt","Keine Berufsausbildung","Betriebliche/schulische Ausbildung","Akademische Ausbildung",null,null,null,"Insgesamt","Keine Berufsausb.","Betriebl./schul. Ausbild.","Akadem. Ausbild."]
["Insgesamt","Insgesamt","15 bis unter 25 Jahre","Insgesamt",{"$f":"$B$1&$A6&$B6&$C6&$D6&E$5","v":"BAInsgesamtInsgesamt15 bis unter 25 JahreInsgesamtInsgesamt"},{"$f":"$B$1&$A6&$B6&$C6&$D6&F$5","v":"BAInsgesamtInsgesamt15 bis unter 25 JahreInsgesamtKeine Berufsausbildung"},"BAInsgesamtInsgesamt15 bis unter 25 JahreInsgesamtBetriebliche/schulische Ausbildung","BAInsgesamtInsgesamt15 bis unter 25 JahreInsgesamtAkademische Ausbildung","BAInsgesamtInsgesamt15 bis unter 25 JahreInsgesamt",null,"15 bis\nunter 25",{"$f":"ROUND(VLOOKUP(E6,Roh!$A$3:$E$4538,$M$1,0),1)","v":7},{"$f":"ROUND(VLOOKUP(F6,Roh!$A$3:$E$4538,$M$1,0),1)","v":8.4},{"$f":"ROUND(VLOOKUP(G6,Roh!$A$3:$E$4538,$M$1,0),1)","v":3.2},{"$f":"ROUND(VLOOKUP(H6,Roh!$A$3:$E$4538,$M$1,0),1)","v":3.7}]
["Insgesamt","Insgesamt","25 bis unter 35 Jahre","Insgesamt",{"$f":"$B$1&$A7&$B7&$C7&$D7&E$5","v":"BAInsgesamtInsgesamt25 bis unter 35 JahreInsgesamtInsgesamt"},"BAInsgesamtInsgesamt25 bis unter 35 JahreInsgesamtKeine Berufsausbildung","BAInsgesamtInsgesamt25 bis unter 35 JahreInsgesamtBetriebliche/schulische Ausbildung","BAInsgesamtInsgesamt25 bis unter 35 JahreInsgesamtAkademische Ausbildung","BAInsgesamtInsgesamt25 bis unter 35 JahreInsgesamt",null,"25 bis\nunter 35",{"$f":"ROUND(VLOOKUP(E7,Roh!$A$3:$E$4538,$M$1,0),1)","v":12.2},{"$f":"ROUND(VLOOKUP(F7,Roh!$A$3:$E$4538,$M$1,0),1)","v":16},{"$f":"ROUND(VLOOKUP(G7,Roh!$A$3:$E$4538,$M$1,0),1)","v":9.3000000000000007},{"$f":"ROUND(VLOOKUP(H7,Roh!$A$3:$E$4538,$M$1,0),1)","v":5.7}]
["Insgesamt","Insgesamt","35 bis unter 45 Jahre","Insgesamt","BAInsgesamtInsgesamt35 bis unter 45 JahreInsgesamtInsgesamt","BAInsgesamtInsgesamt35 bis unter 45 JahreInsgesamtKeine Berufsausbildung","BAInsgesamtInsgesamt35 bis unter 45 JahreInsgesamtBetriebliche/schulische Ausbildung","BAInsgesamtInsgesamt35 bis unter 45 JahreInsgesamtAkademische Ausbildung","BAInsgesamtInsgesamt35 bis unter 45 JahreInsgesamt",null,"35 bis\nunter 45",{"$f":"ROUND(VLOOKUP(E8,Roh!$A$3:$E$4538,$M$1,0),1)","v":14.6},{"$f":"ROUND(VLOOKUP(F8,Roh!$A$3:$E$4538,$M$1,0),1)","v":17.399999999999999},{"$f":"ROUND(VLOOKUP(G8,Roh!$A$3:$E$4538,$M$1,0),1)","v":12.5},{"$f":"ROUND(VLOOKUP(H8,Roh!$A$3:$E$4538,$M$1,0),1)","v":9.1}]
["Insgesamt","Insgesamt","45 bis unter 55 Jahre","Insgesamt","BAInsgesamtInsgesamt45 bis unter 55 JahreInsgesamtInsgesamt","BAInsgesamtInsgesamt45 bis unter 55 JahreInsgesamtKeine Berufsausbildung","BAInsgesamtInsgesamt45 bis unter 55 JahreInsgesamtBetriebliche/schulische Ausbildung","BAInsgesamtInsgesamt45 bis unter 55 JahreInsgesamtAkademische Ausbildung","BAInsgesamtInsgesamt45 bis unter 55 JahreInsgesamt",null,"45 bis\nunter 55",{"$f":"ROUND(VLOOKUP(E9,Roh!$A$3:$E$4538,$M$1,0),1)","v":15.1},{"$f":"ROUND(VLOOKUP(F9,Roh!$A$3:$E$4538,$M$1,0),1)","v":17.399999999999999},{"$f":"ROUND(VLOOKUP(G9,Roh!$A$3:$E$4538,$M$1,0),1)","v":13.1},{"$f":"ROUND(VLOOKUP(H9,Roh!$A$3:$E$4538,$M$1,0),1)","v":11.1}]
["Insgesamt","Insgesamt","55 und älter","Insgesamt","BAInsgesamtInsgesamt55 und älterInsgesamtInsgesamt","BAInsgesamtInsgesamt55 und älterInsgesamtKeine Berufsausbildung","BAInsgesamtInsgesamt55 und älterInsgesamtBetriebliche/schulische Ausbildung","BAInsgesamtInsgesamt55 und älterInsgesamtAkademische Ausbildung","BAInsgesamtInsgesamt55 und älterInsgesamt",null,"55 und \nälter",{"$f":"ROUND(VLOOKUP(E10,Roh!$A$3:$E$4538,$M$1,0),1)","v":23.7},{"$f":"ROUND(VLOOKUP(F10,Roh!$A$3:$E$4538,$M$1,0),1)","v":22.2},{"$f":"ROUND(VLOOKUP(G10,Roh!$A$3:$E$4538,$M$1,0),1)","v":24.8},{"$f":"ROUND(VLOOKUP(H10,Roh!$A$3:$E$4538,$M$1,0),1)","v":24.3}]
[]
["Diagramm Geschlecht"]
["CB_RK","CB_Alter","CB_Staat","CB_BAB","CB_Geschl"]
[2,4,5,6,3]
[null,null,null,null,"Insgesamt","Männlich","Weiblich",null,null,null,null,"Insgesamt","Männlich","Weiblich"]
["Insgesamt","15 bis unter 25 Jahre","Insgesamt","Insgesamt",{"$f":"$B$1&$A16&E$15&$B16&$C16&$D16","v":"BAInsgesamtInsgesamt15 bis unter 25 JahreInsgesamtInsgesamt"},"BAInsgesamtMännlich15 bis unter 25 JahreInsgesamtInsgesamt","BAInsgesamtWeiblich15 bis unter 25 JahreInsgesamtInsgesamt",null,null,null,"15 bis\nunter 25",{"$f":"ROUND(VLOOKUP(E16,Roh!$A$3:$E$4538,$M$1,0),1)","v":7},{"$f":"ROUND(VLOOKUP(F16,Roh!$A$3:$E$4538,$M$1,0),1)","v":7.1},{"$f":"ROUND(VLOOKUP(G16,Roh!$A$3:$E$4538,$M$1,0),1)","v":6.8}]
["Insgesamt","25 bis unter 35 Jahre","Insgesamt","Insgesamt","BAInsgesamtInsgesamt25 bis unter 35 JahreInsgesamtInsgesamt","BAInsgesamtMännlich25 bis unter 35 JahreInsgesamtInsgesamt","BAInsgesamtWeiblich25 bis unter 35 JahreInsgesamtInsgesamt",null,null,null,"25 bis\nunter 35",{"$f":"ROUND(VLOOKUP(E17,Roh!$A$3:$E$4538,$M$1,0),1)","v":12.2},{"$f":"ROUND(VLOOKUP(F17,Roh!$A$3:$E$4538,$M$1,0),1)","v":12},{"$f":"ROUND(VLOOKUP(G17,Roh!$A$3:$E$4538,$M$1,0),1)","v":12.5}]
["Insgesamt","35 bis unter 45 Jahre","Insgesamt","Insgesamt","BAInsgesamtInsgesamt35 bis unter 45 JahreInsgesamtInsgesamt","BAInsgesamtMännlich35 bis unter 45 JahreInsgesamtInsgesamt","BAInsgesamtWeiblich35 bis unter 45 JahreInsgesamtInsgesamt",null,null,null,"35 bis\nunter 45",{"$f":"ROUND(VLOOKUP(E18,Roh!$A$3:$E$4538,$M$1,0),1)","v":14.6},{"$f":"ROUND(VLOOKUP(F18,Roh!$A$3:$E$4538,$M$1,0),1)","v":14.7},{"$f":"ROUND(VLOOKUP(G18,Roh!$A$3:$E$4538,$M$1,0),1)","v":14.5}]
["Insgesamt","45 bis unter 55 Jahre","Insgesamt","Insgesamt","BAInsgesamtInsgesamt45 bis unter 55 JahreInsgesamtInsgesamt","BAInsgesamtMännlich45 bis unter 55 JahreInsgesamtInsgesamt","BAInsgesamtWeiblich45 bis unter 55 JahreInsgesamtInsgesamt",null,null,null,"45 bis\nunter 55",{"$f":"ROUND(VLOOKUP(E19,Roh!$A$3:$E$4538,$M$1,0),1)","v":15.1},{"$f":"ROUND(VLOOKUP(F19,Roh!$A$3:$E$4538,$M$1,0),1)","v":15.7},{"$f":"ROUND(VLOOKUP(G19,Roh!$A$3:$E$4538,$M$1,0),1)","v":14.4}]
["Insgesamt","55 und älter","Insgesamt","Insgesamt","BAInsgesamtInsgesamt55 und älterInsgesamtInsgesamt","BAInsgesamtMännlich55 und älterInsgesamtInsgesamt","BAInsgesamtWeiblich55 und älterInsgesamtInsgesamt",null,null,null,"55 und \nälter",{"$f":"ROUND(VLOOKUP(E20,Roh!$A$3:$E$4538,$M$1,0),1)","v":23.7},{"$f":"ROUND(VLOOKUP(F20,Roh!$A$3:$E$4538,$M$1,0),1)","v":24.8},{"$f":"ROUND(VLOOKUP(G20,Roh!$A$3:$E$4538,$M$1,0),1)","v":22.4}]
[]
["Diagramm Rechtskreis"]
["CB_Geschl","CB_Alter","CB_Staat","CB_BAB","CB_RK"]
[3,4,5,6,2]
[null,null,null,null,"Insgesamt","II","III",null,null,null,null,"Insgesamt","Rechtskreis SGB II im Zugang","Rechtskreis SGB III im Zugang"]
["Insgesamt","15 bis unter 25 Jahre","Insgesamt","Insgesamt",{"$f":"$B$1&E$25&$A26&$B26&$C26&$D26","v":"BAInsgesamtInsgesamt15 bis unter 25 JahreInsgesamtInsgesamt"},"BAIIInsgesamt15 bis unter 25 JahreInsgesamtInsgesamt","BAIIIInsgesamt15 bis unter 25 JahreInsgesamtInsgesamt",null,null,null,"15 bis\nunter 25",{"$f":"ROUND(VLOOKUP(E26,Roh!$A$3:$E$4538,$M$1,0),1)","v":7},{"$f":"ROUND(VLOOKUP(F26,Roh!$A$3:$E$4538,$M$1,0),1)","v":10.8},{"$f":"ROUND(VLOOKUP(G26,Roh!$A$3:$E$4538,$M$1,0),1)","v":3.1}]
["Insgesamt","25 bis unter 35 Jahre","Insgesamt","Insgesamt","BAInsgesamtInsgesamt25 bis unter 35 JahreInsgesamtInsgesamt","BAIIInsgesamt25 bis unter 35 JahreInsgesamtInsgesamt","BAIIIInsgesamt25 bis unter 35 JahreInsgesamtInsgesamt",null,null,null,"25 bis\nunter 35",{"$f":"ROUND(VLOOKUP(E27,Roh!$A$3:$E$4538,$M$1,0),1)","v":12.2},{"$f":"ROUND(VLOOKUP(F27,Roh!$A$3:$E$4538,$M$1,0),1)","v":19.3},{"$f":"ROUND(VLOOKUP(G27,Roh!$A$3:$E$4538,$M$1,0),1)","v":6.1}]
["Insgesamt","35 bis unter 45 Jahre","Insgesamt","Insgesamt","BAInsgesamtInsgesamt35 bis unter 45 JahreInsgesamtInsgesamt","BAIIInsgesamt35 bis unter 45 JahreInsgesamtInsgesamt","BAIIIInsgesamt35 bis unter 45 JahreInsgesamtInsgesamt",null,null,null,"35 bis\nunter 45",{"$f":"ROUND(VLOOKUP(E28,Roh!$A$3:$E$4538,$M$1,0),1)","v":14.6},{"$f":"ROUND(VLOOKUP(F28,Roh!$A$3:$E$4538,$M$1,0),1)","v":20.7},{"$f":"ROUND(VLOOKUP(G28,Roh!$A$3:$E$4538,$M$1,0),1)","v":7.7}]
["Insgesamt","45 bis unter 55 Jahre","Insgesamt","Insgesamt","BAInsgesamtInsgesamt45 bis unter 55 JahreInsgesamtInsgesamt","BAIIInsgesamt45 bis unter 55 JahreInsgesamtInsgesamt","BAIIIInsgesamt45 bis unter 55 JahreInsgesamtInsgesamt",null,null,null,"45 bis\nunter 55",{"$f":"ROUND(VLOOKUP(E29,Roh!$A$3:$E$4538,$M$1,0),1)","v":15.1},{"$f":"ROUND(VLOOKUP(F29,Roh!$A$3:$E$4538,$M$1,0),1)","v":20.8},{"$f":"ROUND(VLOOKUP(G29,Roh!$A$3:$E$4538,$M$1,0),1)","v":9.1}]
["Insgesamt","55 und älter","Insgesamt","Insgesamt","BAInsgesamtInsgesamt55 und älterInsgesamtInsgesamt","BAIIInsgesamt55 und älterInsgesamtInsgesamt","BAIIIInsgesamt55 und älterInsgesamtInsgesamt",null,null,null,"55 und \nälter",{"$f":"ROUND(VLOOKUP(E30,Roh!$A$3:$E$4538,$M$1,0),1)","v":23.7},{"$f":"ROUND(VLOOKUP(F30,Roh!$A$3:$E$4538,$M$1,0),1)","v":22},{"$f":"ROUND(VLOOKUP(G30,Roh!$A$3:$E$4538,$M$1,0),1)","v":24.9}]
[]
["Diagramm Staatsangehörigkeit"]
["CB_RK","CB_Geschl","CB_Alter","CB_BAB","CB_Staat"]
[2,3,4,6,5]
[null,null,null,null,"Insgesamt","Deutsche","Ausländer",null,null,null,null,"Insgesamt","Deutsche","Ausländer"]
["Insgesamt","Insgesamt","15 bis unter 25 Jahre","Insgesamt",{"$f":"$B$1&$A36&$B36&$C36&E$35&$D36","v":"BAInsgesamtInsgesamt15 bis unter 25 JahreInsgesamtInsgesamt"},"BAInsgesamtInsgesamt15 bis unter 25 JahreDeutscheInsgesamt","BAInsgesamtInsgesamt15 bis unter 25 JahreAusländerInsgesamt",null,null,null,"15 bis\nunter 25",{"$f":"ROUND(VLOOKUP(E36,Roh!$A$3:$E$4538,$M$1,0),1)","v":7},{"$f":"ROUND(VLOOKUP(F36,Roh!$A$3:$E$4538,$M$1,0),1)","v":6.7},{"$f":"ROUND(VLOOKUP(G36,Roh!$A$3:$E$4538,$M$1,0),1)","v":7.5}]
["Insgesamt","Insgesamt","25 bis unter 35 Jahre","Insgesamt","BAInsgesamtInsgesamt25 bis unter 35 JahreInsgesamtInsgesamt","BAInsgesamtInsgesamt25 bis unter 35 JahreDeutscheInsgesamt","BAInsgesamtInsgesamt25 bis unter 35 JahreAusländerInsgesamt",null,null,null,"25 bis\nunter 35",{"$f":"ROUND(VLOOKUP(E37,Roh!$A$3:$E$4538,$M$1,0),1)","v":12.2},{"$f":"ROUND(VLOOKUP(F37,Roh!$A$3:$E$4538,$M$1,0),1)","v":11.6},{"$f":"ROUND(VLOOKUP(G37,Roh!$A$3:$E$4538,$M$1,0),1)","v":13.2}]
["Insgesamt","Insgesamt","35 bis unter 45 Jahre","Insgesamt","BAInsgesamtInsgesamt35 bis unter 45 JahreInsgesamtInsgesamt","BAInsgesamtInsgesamt35 bis unter 45 JahreDeutscheInsgesamt","BAInsgesamtInsgesamt35 bis unter 45 JahreAusländerInsgesamt",null,null,null,"35 bis\nunter 45",{"$f":"ROUND(VLOOKUP(E38,Roh!$A$3:$E$4538,$M$1,0),1)","v":14.6},{"$f":"ROUND(VLOOKUP(F38,Roh!$A$3:$E$4538,$M$1,0),1)","v":14},{"$f":"ROUND(VLOOKUP(G38,Roh!$A$3:$E$4538,$M$1,0),1)","v":15.3}]
["Insgesamt","Insgesamt","45 bis unter 55 Jahre","Insgesamt","BAInsgesamtInsgesamt45 bis unter 55 JahreInsgesamtInsgesamt","BAInsgesamtInsgesamt45 bis unter 55 JahreDeutscheInsgesamt","BAInsgesamtInsgesamt45 bis unter 55 JahreAusländerInsgesamt",null,null,null,"45 bis\nunter 55",{"$f":"ROUND(VLOOKUP(E39,Roh!$A$3:$E$4538,$M$1,0),1)","v":15.1},{"$f":"ROUND(VLOOKUP(F39,Roh!$A$3:$E$4538,$M$1,0),1)","v":14},{"$f":"ROUND(VLOOKUP(G39,Roh!$A$3:$E$4538,$M$1,0),1)","v":16.600000000000001}]
["Insgesamt","Insgesamt","55 und älter","Insgesamt","BAInsgesamtInsgesamt55 und älterInsgesamtInsgesamt","BAInsgesamtInsgesamt55 und älterDeutscheInsgesamt","BAInsgesamtInsgesamt55 und älterAusländerInsgesamt",null,null,null,"55 und \nälter",{"$f":"ROUND(VLOOKUP(E40,Roh!$A$3:$E$4538,$M$1,0),1)","v":23.7},{"$f":"ROUND(VLOOKUP(F40,Roh!$A$3:$E$4538,$M$1,0),1)","v":24.5},{"$f":"ROUND(VLOOKUP(G40,Roh!$A$3:$E$4538,$M$1,0),1)","v":21.1}]

{"sheet":"Berufsausbildung","index":10,"n_rows":48,"n_cols":14,"rows_kept":48,"cut":false,"hidden":true,"merged":[]}
["Region1",{"$f":"Steuer!B3","v":"BA"},null,null,null,null,null,null,"Daten",{"$f":"Steuer!M6","v":5}]
["Auswahlmöglichkeiten",null,null,null,null,null,null,null,null,null,null,"CB_RK","CB_Geschl","CB_Staat"]
[false,"Geschlecht",null,"Männlich","Weiblich","CB_Geschl",3,null,null,null,null,2,3,5]
[false,"Staatsangehörigkeit",null,"Deutsche","Ausländer","CB_Staat",5]
[true,"Rechtskreis im Zugang",null,"II","III","CB_RK",2,null,null,null,null,"Insgesamt","Insgesamt","Insgesamt"]
["Auswahl"]
[true,{"$f":"VLOOKUP($A$7,$A$3:$G$5,COLUMN(),0)","v":"Rechtskreis im Zugang"},null,{"$f":"VLOOKUP($A$7,$A$3:$G$5,COLUMN(),0)","v":"II"},{"$f":"VLOOKUP($A$7,$A$3:$G$5,COLUMN(),0)","v":"III"},"CB_RK",2]
[]
[]
["Diagramm Berufsausbildung - Insgesamt",null,null,"CB_BAB","Insgesamt"]
[null,null,null,"CB_Alter",{"$f":"$F$7","v":"CB_RK"}]
[null,null,null,4,{"$f":"$G$7","v":2}]
[null,null,null,null,{"$f":"D7","v":"II"},{"$f":"E7","v":"III"},null,null,{"$f":"IF(D7=\"II\",\"Rechtskreis SGB II\",D7)","v":"Rechtskreis SGB II"},{"$f":"IF(E7=\"III\",\"Rechtskreis SGB III\",E7)","v":"Rechtskreis SGB III"}]
[null,null,null,"15 bis unter 25 Jahre",{"$f":"IF($G$7=3,$B$1&$L$5&E$13&$D14&$N$5&$E$10,IF($G$7=2,$B$1&E$13&$M$5&$D14&$N$5&$E$10,$B$1&$L$5&$M$5&$D14&E$13&$E$10))","v":"BAIIInsgesamt15 bis unter 25 JahreInsgesamtInsgesamt"},{"$f":"IF($G$7=3,$B$1&$L$5&F$13&$D14&$N$5&$E$10,IF($G$7=2,$B$1&F$13&$M$5&$D14&$N$5&$E$10,$B$1&$L$5&$M$5&$D14&F$13&$E$10))","v":"BAIIIInsgesamt15 bis unter 25 JahreInsgesamtInsgesamt"},null,"15 bis\nunter 25",{"$f":"ROUND(VLOOKUP(E14,Roh!$A$3:$E$4538,$J$1,0),1)","v":10.8},{"$f":"ROUND(VLOOKUP(F14,Roh!$A$3:$E$4538,$J$1,0),1)","v":3.1}]
[null,null,null,"25 bis unter 35 Jahre",{"$f":"IF($G$7=3,$B$1&$L$5&E$13&$D15&$N$5&$E$10,IF($G$7=2,$B$1&E$13&$M$5&$D15&$N$5&$E$10,$B$1&$L$5&$M$5&$D15&E$13&$E$10))","v":"BAIIInsgesamt25 bis unter 35 JahreInsgesamtInsgesamt"},"BAIIIInsgesamt25 bis unter 35 JahreInsgesamtInsgesamt",null,"25 bis\nunter 35",{"$f":"ROUND(VLOOKUP(E15,Roh!$A$3:$E$4538,$J$1,0),1)","v":19.3},{"$f":"ROUND(VLOOKUP(F15,Roh!$A$3:$E$4538,$J$1,0),1)","v":6.1}]
[null,null,null,"35 bis unter 45 Jahre","BAIIInsgesamt35 bis unter 45 JahreInsgesamtInsgesamt","BAIIIInsgesamt35 bis unter 45 JahreInsgesamtInsgesamt",null,"35 bis\nunter 45",{"$f":"ROUND(VLOOKUP(E16,Roh!$A$3:$E$4538,$J$1,0),1)","v":20.7},{"$f":"ROUND(VLOOKUP(F16,Roh!$A$3:$E$4538,$J$1,0),1)","v":7.7}]
[null,null,null,"45 bis unter 55 Jahre","BAIIInsgesamt45 bis unter 55 JahreInsgesamtInsgesamt","BAIIIInsgesamt45 bis unter 55 JahreInsgesamtInsgesamt",null,"45 bis\nunter 55",{"$f":"ROUND(VLOOKUP(E17,Roh!$A$3:$E$4538,$J$1,0),1)","v":20.8},{"$f":"ROUND(VLOOKUP(F17,Roh!$A$3:$E$4538,$J$1,0),1)","v":9.1}]
[null,null,null,"55 und älter","BAIIInsgesamt55 und älterInsgesamtInsgesamt","BAIIIInsgesamt55 und älterInsgesamtInsgesamt",null,"55 und \nälter",{"$f":"ROUND(VLOOKUP(E18,Roh!$A$3:$E$4538,$J$1,0),1)","v":22},{"$f":"ROUND(VLOOKUP(F18,Roh!$A$3:$E$4538,$J$1,0),1)","v":24.9}]
[]
["Diagramm Berufliche / schulische Ausbildung",null,null,"CB_BAB","Betriebliche/schulische Ausbildung"]
[null,null,null,"CB_Alter",{"$f":"$F$7","v":"CB_RK"}]
[null,null,null,4,{"$f":"$G$7","v":2}]
[null,null,null,null,{"$f":"D7","v":"II"},{"$f":"E7","v":"III"},null,null,{"$f":"I13","v":"Rechtskreis SGB II"},{"$f":"J13","v":"Rechtskreis SGB III"}]
[null,null,null,"15 bis unter 25 Jahre",{"$f":"IF($G$7=3,$B$1&$L$5&E$23&$D24&$N$5&$E$20,IF($G$7=2,$B$1&E$23&$M$5&$D24&$N$5&$E$20,$B$1&$L$5&$M$5&$D24&E$23&$E$20))","v":"BAIIInsgesamt15 bis unter 25 JahreInsgesamtBetriebliche/schulische Ausbildung"},{"$f":"IF($G$7=3,$B$1&$L$5&F$23&$D24&$N$5&$E$20,IF($G$7=2,$B$1&F$23&$M$5&$D24&$N$5&$E$20,$B$1&$L$5&$M$5&$D24&F$23&$E$20))","v":"BAIIIInsgesamt15 bis unter 25 JahreInsgesamtBetriebliche/schulische Ausbildung"},null,"15 bis\nunter 25",{"$f":"ROUND(VLOOKUP(E24,Roh!$A$3:$E$4538,$J$1,0),1)","v":10.6},{"$f":"ROUND(VLOOKUP(F24,Roh!$A$3:$E$4538,$J$1,0),1)","v":2.5}]
[null,null,null,"25 bis unter 35 Jahre",{"$f":"IF($G$7=3,$B$1&$L$5&E$23&$D25&$N$5&$E$20,IF($G$7=2,$B$1&E$23&$M$5&$D25&$N$5&$E$20,$B$1&$L$5&$M$5&$D25&E$23&$E$20))","v":"BAIIInsgesamt25 bis unter 35 JahreInsgesamtBetriebliche/schulische Ausbildung"},"BAIIIInsgesamt25 bis unter 35 JahreInsgesamtBetriebliche/schulische Ausbildung",null,"25 bis\nunter 35",{"$f":"ROUND(VLOOKUP(E25,Roh!$A$3:$E$4538,$J$1,0),1)","v":20.7},{"$f":"ROUND(VLOOKUP(F25,Roh!$A$3:$E$4538,$J$1,0),1)","v":5.7}]
[null,null,null,"35 bis unter 45 Jahre","BAIIInsgesamt35 bis unter 45 JahreInsgesamtBetriebliche/schulische Ausbildung","BAIIIInsgesamt35 bis unter 45 JahreInsgesamtBetriebliche/schulische Ausbildung",null,"35 bis\nunter 45",{"$f":"ROUND(VLOOKUP(E26,Roh!$A$3:$E$4538,$J$1,0),1)","v":22.9},{"$f":"ROUND(VLOOKUP(F26,Roh!$A$3:$E$4538,$J$1,0),1)","v":7.3}]
[null,null,null,"45 bis unter 55 Jahre","BAIIInsgesamt45 bis unter 55 JahreInsgesamtBetriebliche/schulische Ausbildung","BAIIIInsgesamt45 bis unter 55 JahreInsgesamtBetriebliche/schulische Ausbildung",null,"45 bis\nunter 55",{"$f":"ROUND(VLOOKUP(E27,Roh!$A$3:$E$4538,$J$1,0),1)","v":21.5},{"$f":"ROUND(VLOOKUP(F27,Roh!$A$3:$E$4538,$J$1,0),1)","v":8.6999999999999993}]
[null,null,null,"55 und älter","BAIIInsgesamt55 und älterInsgesamtBetriebliche/schulische Ausbildung","BAIIIInsgesamt55 und älterInsgesamtBetriebliche/schulische Ausbildung",null,"55 und \nälter",{"$f":"ROUND(VLOOKUP(E28,Roh!$A$3:$E$4538,$J$1,0),1)","v":22.7},{"$f":"ROUND(VLOOKUP(F28,Roh!$A$3:$E$4538,$J$1,0),1)","v":25.7}]
[]
["Diagramm Keine Berufsausbildung",null,null,"CB_BAB","Keine Berufsausbildung"]
[null,null,null,"CB_Alter",{"$f":"$F$7","v":"CB_RK"}]
[null,null,null,4,{"$f":"$G$7","v":2}]
[null,null,null,null,{"$f":"D7","v":"II"},{"$f":"E7","v":"III"},null,null,{"$f":"I13","v":"Rechtskreis SGB II"},{"$f":"J13","v":"Rechtskreis SGB III"}]
[null,null,null,"15 bis unter 25 Jahre",{"$f":"IF($G$7=3,$B$1&$L$5&E$33&$D34&$N$5&$E$30,IF($G$7=2,$B$1&E$33&$M$5&$D34&$N$5&$E$30,$B$1&$L$5&$M$5&$D34&E$33&$E$30))","v":"BAIIInsgesamt15 bis unter 25 JahreInsgesamtKeine Berufsausbildung"},{"$f":"IF($G$7=3,$B$1&$L$5&F$33&$D34&$N$5&$E$30,IF($G$7=2,$B$1&F$33&$M$5&$D34&$N$5&$E$30,$B$1&$L$5&$M$5&$D34&F$33&$E$30))","v":"BAIIIInsgesamt15 bis unter 25 JahreInsgesamtKeine Berufsausbildung"},null,"15 bis\nunter 25",{"$f":"ROUND(VLOOKUP(E34,Roh!$A$3:$E$4538,$J$1,0),1)","v":10.9},{"$f":"ROUND(VLOOKUP(F34,Roh!$A$3:$E$4538,$J$1,0),1)","v":3.9}]
[null,null,null,"25 bis unter 35 Jahre",{"$f":"IF($G$7=3,$B$1&$L$5&E$33&$D35&$N$5&$E$30,IF($G$7=2,$B$1&E$33&$M$5&$D35&$N$5&$E$30,$B$1&$L$5&$M$5&$D35&E$33&$E$30))","v":"BAIIInsgesamt25 bis unter 35 JahreInsgesamtKeine Berufsausbildung"},"BAIIIInsgesamt25 bis unter 35 JahreInsgesamtKeine Berufsausbildung",null,"25 bis\nunter 35",{"$f":"ROUND(VLOOKUP(E35,Roh!$A$3:$E$4538,$J$1,0),1)","v":19.899999999999999},{"$f":"ROUND(VLOOKUP(F35,Roh!$A$3:$E$4538,$J$1,0),1)","v":8.3000000000000007}]
[null,null,null,"35 bis unter 45 Jahre","BAIIInsgesamt35 bis unter 45 JahreInsgesamtKeine Berufsausbildung","BAIIIInsgesamt35 bis unter 45 JahreInsgesamtKeine Berufsausbildung",null,"35 bis\nunter 45",{"$f":"ROUND(VLOOKUP(E36,Roh!$A$3:$E$4538,$J$1,0),1)","v":20.6},{"$f":"ROUND(VLOOKUP(F36,Roh!$A$3:$E$4538,$J$1,0),1)","v":9.4}]
[null,null,null,"45 bis unter 55 Jahre","BAIIInsgesamt45 bis unter 55 JahreInsgesamtKeine Berufsausbildung","BAIIIInsgesamt45 bis unter 55 JahreInsgesamtKeine Berufsausbildung",null,"45 bis\nunter 55",{"$f":"ROUND(VLOOKUP(E37,Roh!$A$3:$E$4538,$J$1,0),1)","v":20.7},{"$f":"ROUND(VLOOKUP(F37,Roh!$A$3:$E$4538,$J$1,0),1)","v":10.199999999999999}]
[null,null,null,"55 und älter","BAIIInsgesamt55 und älterInsgesamtKeine Berufsausbildung","BAIIIInsgesamt55 und älterInsgesamtKeine Berufsausbildung",null,"55 und \nälter",{"$f":"ROUND(VLOOKUP(E38,Roh!$A$3:$E$4538,$J$1,0),1)","v":21.4},{"$f":"ROUND(VLOOKUP(F38,Roh!$A$3:$E$4538,$J$1,0),1)","v":23.6}]
[]
["Diagramm Akademische Ausbildung",null,null,"CB_BAB","Akademische Ausbildung"]
[null,null,null,"CB_Alter",{"$f":"$F$7","v":"CB_RK"}]
[null,null,null,4,{"$f":"$G$7","v":2}]
[null,null,null,null,{"$f":"D7","v":"II"},{"$f":"E7","v":"III"},null,null,{"$f":"I13","v":"Rechtskreis SGB II"},{"$f":"J13","v":"Rechtskreis SGB III"}]
[null,null,null,"15 bis unter 25 Jahre",{"$f":"IF($G$7=3,$B$1&$L$5&E$43&$D44&$N$5&$E$40,IF($G$7=2,$B$1&E$43&$M$5&$D44&$N$5&$E$40,$B$1&$L$5&$M$5&$D44&E$43&$E$40))","v":"BAIIInsgesamt15 bis unter 25 JahreInsgesamtAkademische Ausbildung"},{"$f":"IF($G$7=3,$B$1&$L$5&F$43&$D44&$N$5&$E$40,IF($G$7=2,$B$1&F$43&$M$5&$D44&$N$5&$E$40,$B$1&$L$5&$M$5&$D44&F$43&$E$40))","v":"BAIIIInsgesamt15 bis unter 25 JahreInsgesamtAkademische Ausbildung"},null,"15 bis\nunter 25",{"$f":"ROUND(VLOOKUP(E44,Roh!$A$3:$E$4538,$J$1,0),1)","v":7.6},{"$f":"ROUND(VLOOKUP(F44,Roh!$A$3:$E$4538,$J$1,0),1)","v":1.1000000000000001}]
[null,null,null,"25 bis unter 35 Jahre",{"$f":"IF($G$7=3,$B$1&$L$5&E$43&$D45&$N$5&$E$40,IF($G$7=2,$B$1&E$43&$M$5&$D45&$N$5&$E$40,$B$1&$L$5&$M$5&$D45&E$43&$E$40))","v":"BAIIInsgesamt25 bis unter 35 JahreInsgesamtAkademische Ausbildung"},"BAIIIInsgesamt25 bis unter 35 JahreInsgesamtAkademische Ausbildung",null,"25 bis\nunter 35",{"$f":"ROUND(VLOOKUP(E45,Roh!$A$3:$E$4538,$J$1,0),1)","v":11.8},{"$f":"ROUND(VLOOKUP(F45,Roh!$A$3:$E$4538,$J$1,0),1)","v":3.9}]
[null,null,null,"35 bis unter 45 Jahre","BAIIInsgesamt35 bis unter 45 JahreInsgesamtAkademische Ausbildung","BAIIIInsgesamt35 bis unter 45 JahreInsgesamtAkademische Ausbildung",null,"35 bis\nunter 45",{"$f":"ROUND(VLOOKUP(E46,Roh!$A$3:$E$4538,$J$1,0),1)","v":15.8},{"$f":"ROUND(VLOOKUP(F46,Roh!$A$3:$E$4538,$J$1,0),1)","v":6.2}]
[null,null,null,"45 bis unter 55 Jahre","BAIIInsgesamt45 bis unter 55 JahreInsgesamtAkademische Ausbildung","BAIIIInsgesamt45 bis unter 55 JahreInsgesamtAkademische Ausbildung",null,"45 bis\nunter 55",{"$f":"ROUND(VLOOKUP(E47,Roh!$A$3:$E$4538,$J$1,0),1)","v":18.3},{"$f":"ROUND(VLOOKUP(F47,Roh!$A$3:$E$4538,$J$1,0),1)","v":8.1}]
[null,null,null,"55 und älter","BAIIInsgesamt55 und älterInsgesamtAkademische Ausbildung","BAIIIInsgesamt55 und älterInsgesamtAkademische Ausbildung",null,"55 und \nälter",{"$f":"ROUND(VLOOKUP(E48,Roh!$A$3:$E$4538,$J$1,0),1)","v":24.9},{"$f":"ROUND(VLOOKUP(F48,Roh!$A$3:$E$4538,$J$1,0),1)","v":24.2}]

{"sheet":"Geschlecht","index":11,"n_rows":34,"n_cols":15,"rows_kept":34,"cut":false,"hidden":true,"merged":[]}
["Region1",{"$f":"Steuer!B3","v":"BA"},null,null,null,null,null,null,null,"Daten",{"$f":"Steuer!M6","v":5}]
["Auswahlmöglichkeiten",null,null,null,{"$f":"LEN(E3)","v":34},null,null,null,null,null,null,null,"CB_RK","CB_Staat","CB_BAB"]
[false,"Berufsausbildung",null,"Keine Berufsausbildung","Betriebliche/schulische Ausbildung","Akademische Ausbildung","CB_Geschl",6,35,null,null,null,2,5,6]
[false,"Staatsangehörigkeit",null,"Deutsche","Ausländer",{"$f":"NA()","v":{"$error":"#N/A"}},"CB_Staat",5,37]
[true,"Rechtskreis im Zugang",null,"II","III",{"$f":"NA()","v":{"$error":"#N/A"}},"CB_RK",2,36,null,null,null,"Insgesamt","Insgesamt","Insgesamt"]
["Auswahl"]
[true,{"$f":"VLOOKUP($A$7,$A$3:$I$5,COLUMN(),0)","v":"Rechtskreis im Zugang"},null,{"$f":"VLOOKUP($A$7,$A$3:$I$5,COLUMN(),0)","v":"II"},"III",{"$error":"#N/A"},"CB_RK",2,36]
[]
[]
["Diagramm Männer",null,null,"CB_Geschl","Männlich"]
[null,null,null,"CB_Alter",{"$f":"$G$7","v":"CB_RK"}]
[null,null,null,4,{"$f":"$H$7","v":2}]
[null,null,null,null,{"$f":"D7","v":"II"},{"$f":"E7","v":"III"},{"$f":"F7","v":{"$error":"#N/A"}},null,null,{"$f":"IF($D$7=\"II\",\"Rechtskreis SGB II\",$D$7)&REPT(\"  \",$E$2-LEN(IF($D$7=\"II\",\"Rechtskreis SGB II\",$D$7)))","v":"Rechtskreis SGB II                                "},{"$f":"IF($E$7=\"III\",\"Rechtskreis SGB III\",$E$7)&REPT(\" \",$E$2-LEN(IF($E$7=\"III\",\"Rechtskreis SGB III\",$E$7)))","v":"Rechtskreis SGB III               "},{"$f":"$F$7&REPT(\" \",$E$2-LEN(F7))","v":{"$error":"#N/A"}}]
[null,null,null,"15 bis unter 25 Jahre",{"$f":"IF($H$7=2,$B$1&E$13&$E$10&$D14&$N$5&$O$5,IF($H$7=5,$B$1&$M$5&$E$10&$D14&E$13&$O$5,$B$1&$M$5&$E$10&$D14&$N$5&E$13))","v":"BAIIMännlich15 bis unter 25 JahreInsgesamtInsgesamt"},{"$f":"IF($H$7=2,$B$1&F$13&$E$10&$D14&$N$5&$O$5,IF($H$7=5,$B$1&$M$5&$E$10&$D14&F$13&$O$5,$B$1&$M$5&$E$10&$D14&$N$5&F$13))","v":"BAIIIMännlich15 bis unter 25 JahreInsgesamtInsgesamt"},{"$error":"#N/A"},null,"15 bis\nunter 25",{"$f":"ROUND(VLOOKUP(E14,Roh!$A$3:$E$4538,$K$1,0),1)","v":11.5},{"$f":"ROUND(VLOOKUP(F14,Roh!$A$3:$E$4538,$K$1,0),1)","v":3.3},{"$f":"ROUND(VLOOKUP(G14,Roh!$A$3:$E$4538,$K$1,0),1)","v":{"$error":"#N/A"}}]
[null,null,null,"25 bis unter 35 Jahre",{"$f":"IF($H$7=2,$B$1&E$13&$E$10&$D15&$N$5&$O$5,IF($H$7=5,$B$1&$M$5&$E$10&$D15&E$13&$O$5,$B$1&$M$5&$E$10&$D15&$N$5&E$13))","v":"BAIIMännlich25 bis unter 35 JahreInsgesamtInsgesamt"},"BAIIIMännlich25 bis unter 35 JahreInsgesamtInsgesamt",{"$error":"#N/A"},null,"25 bis\nunter 35",{"$f":"ROUND(VLOOKUP(E15,Roh!$A$3:$E$4538,$K$1,0),1)","v":19.7},{"$f":"ROUND(VLOOKUP(F15,Roh!$A$3:$E$4538,$K$1,0),1)","v":6.5},{"$f":"ROUND(VLOOKUP(G15,Roh!$A$3:$E$4538,$K$1,0),1)","v":{"$error":"#N/A"}}]
[null,null,null,"35 bis unter 45 Jahre","BAIIMännlich35 bis unter 45 JahreInsgesamtInsgesamt","BAIIIMännlich35 bis unter 45 JahreInsgesamtInsgesamt",{"$error":"#N/A"},null,"35 bis\nunter 45",{"$f":"ROUND(VLOOKUP(E16,Roh!$A$3:$E$4538,$K$1,0),1)","v":22},{"$f":"ROUND(VLOOKUP(F16,Roh!$A$3:$E$4538,$K$1,0),1)","v":8.1},{"$f":"ROUND(VLOOKUP(G16,Roh!$A$3:$E$4538,$K$1,0),1)","v":{"$error":"#N/A"}}]
[null,null,null,"45 bis unter 55 Jahre","BAIIMännlich45 bis unter 55 JahreInsgesamtInsgesamt","BAIIIMännlich45 bis unter 55 JahreInsgesamtInsgesamt",{"$error":"#N/A"},null,"45 bis\nunter 55",{"$f":"ROUND(VLOOKUP(E17,Roh!$A$3:$E$4538,$K$1,0),1)","v":22.4},{"$f":"ROUND(VLOOKUP(F17,Roh!$A$3:$E$4538,$K$1,0),1)","v":9.6999999999999993},{"$f":"ROUND(VLOOKUP(G17,Roh!$A$3:$E$4538,$K$1,0),1)","v":{"$error":"#N/A"}}]
[null,null,null,"55 und älter","BAIIMännlich55 und älterInsgesamtInsgesamt","BAIIIMännlich55 und älterInsgesamtInsgesamt",{"$error":"#N/A"},null,"55 und \nälter",{"$f":"ROUND(VLOOKUP(E18,Roh!$A$3:$E$4538,$K$1,0),1)","v":23},{"$f":"ROUND(VLOOKUP(F18,Roh!$A$3:$E$4538,$K$1,0),1)","v":26},{"$f":"ROUND(VLOOKUP(G18,Roh!$A$3:$E$4538,$K$1,0),1)","v":{"$error":"#N/A"}}]
[]
["Diagramm Frauen",null,null,"CB_Geschl","Weiblich"]
[null,null,null,"CB_Alter",{"$f":"$G$7","v":"CB_RK"}]
[null,null,null,4,{"$f":"$H$7","v":2}]
[null,null,null,null,{"$f":"D7","v":"II"},{"$f":"E7","v":"III"},{"$f":"F7","v":{"$error":"#N/A"}},null,null,{"$f":"J13","v":"Rechtskreis SGB II                                "},{"$f":"K13","v":"Rechtskreis SGB III               "},{"$error":"#N/A"}]
[null,null,null,"15 bis unter 25 Jahre",{"$f":"IF($H$7=2,$B$1&E$23&$E$20&$D24&$N$5&$O$5,IF($H$7=5,$B$1&$M$5&$E$20&$D24&E$23&$O$5,$B$1&$M$5&$E$20&$D24&$N$5&E$23))","v":"BAIIWeiblich15 bis unter 25 JahreInsgesamtInsgesamt"},{"$f":"IF($H$7=2,$B$1&F$23&$E$20&$D24&$N$5&$O$5,IF($H$7=5,$B$1&$M$5&$E$20&$D24&F$23&$O$5,$B$1&$M$5&$E$20&$D24&$N$5&F$23))","v":"BAIIIWeiblich15 bis unter 25 JahreInsgesamtInsgesamt"},{"$error":"#N/A"},null,"15 bis\nunter 25",{"$f":"ROUND(VLOOKUP(E24,Roh!$A$3:$E$4538,$K$1,0),1)","v":10.1},{"$f":"ROUND(VLOOKUP(F24,Roh!$A$3:$E$4538,$K$1,0),1)","v":2.8},{"$f":"ROUND(VLOOKUP(G24,Roh!$A$3:$E$4538,$K$1,0),1)","v":{"$error":"#N/A"}}]
[null,null,null,"25 bis unter 35 Jahre",{"$f":"IF($H$7=2,$B$1&E$23&$E$20&$D25&$N$5&$O$5,IF($H$7=5,$B$1&$M$5&$E$20&$D25&E$23&$O$5,$B$1&$M$5&$E$20&$D25&$N$5&E$23))","v":"BAIIWeiblich25 bis unter 35 JahreInsgesamtInsgesamt"},"BAIIIWeiblich25 bis unter 35 JahreInsgesamtInsgesamt",{"$error":"#N/A"},null,"25 bis\nunter 35",{"$f":"ROUND(VLOOKUP(E25,Roh!$A$3:$E$4538,$K$1,0),1)","v":19},{"$f":"ROUND(VLOOKUP(F25,Roh!$A$3:$E$4538,$K$1,0),1)","v":5.6},{"$f":"ROUND(VLOOKUP(G25,Roh!$A$3:$E$4538,$K$1,0),1)","v":{"$error":"#N/A"}}]
[null,null,null,"35 bis unter 45 Jahre","BAIIWeiblich35 bis unter 45 JahreInsgesamtInsgesamt","BAIIIWeiblich35 bis unter 45 JahreInsgesamtInsgesamt",{"$error":"#N/A"},null,"35 bis\nunter 45",{"$f":"ROUND(VLOOKUP(E26,Roh!$A$3:$E$4538,$K$1,0),1)","v":19.600000000000001},{"$f":"ROUND(VLOOKUP(F26,Roh!$A$3:$E$4538,$K$1,0),1)","v":7.2},{"$f":"ROUND(VLOOKUP(G26,Roh!$A$3:$E$4538,$K$1,0),1)","v":{"$error":"#N/A"}}]
[null,null,null,"45 bis unter 55 Jahre","BAIIWeiblich45 bis unter 55 JahreInsgesamtInsgesamt","BAIIIWeiblich45 bis unter 55 JahreInsgesamtInsgesamt",{"$error":"#N/A"},null,"45 bis\nunter 55",{"$f":"ROUND(VLOOKUP(E27,Roh!$A$3:$E$4538,$K$1,0),1)","v":19.3},{"$f":"ROUND(VLOOKUP(F27,Roh!$A$3:$E$4538,$K$1,0),1)","v":8.4},{"$f":"ROUND(VLOOKUP(G27,Roh!$A$3:$E$4538,$K$1,0),1)","v":{"$error":"#N/A"}}]
[null,null,null,"55 und älter","BAIIWeiblich55 und älterInsgesamtInsgesamt","BAIIIWeiblich55 und älterInsgesamtInsgesamt",{"$error":"#N/A"},null,"55 und \nälter",{"$f":"ROUND(VLOOKUP(E28,Roh!$A$3:$E$4538,$K$1,0),1)","v":21.1},{"$f":"ROUND(VLOOKUP(F28,Roh!$A$3:$E$4538,$K$1,0),1)","v":23.6},{"$f":"ROUND(VLOOKUP(G28,Roh!$A$3:$E$4538,$K$1,0),1)","v":{"$error":"#N/A"}}]
[]
[]
[]
[]
[null,null,null,null,"Auswahl zur Anezige der Legende über defenierte Fromel \"Legende\""]
[null,null,null,null,{"$f":"I7","v":36}]