{"text_format":"1","workbook":"xlsx","n_sheets":12,"sheets":["Einstieg","Tab_1","Tab_2","Tab_3","Tab_4","Tab_5","Steuer","Roh","Berechnung","Merkmale","Berufsausbildung","Geschlecht"],"not_rendered":{"charts":14,"images":33,"macros":1,"external_links":1,"defined_names":46,"comments":0,"pivot_tables":0},"unopened":[],"bounds":{"document_bytes":16777216,"sheet_cells":100000,"rows_first":2000,"rows_last":500,"rows_between":2000,"halvings":0,"cell_chars":16384,"cell_head_chars":4096},"cells_cut":0,"cells_raw":0,"read":"whole","date_system":"1900"}

{"sheet":"Einstieg","index":0,"n_rows":35,"n_cols":15,"rows_kept":35,"cut":false,"hidden":false,"merged":[]}
[]
[]
[]
[]
[]
[null,null,null,"Übertrittsrisiko in Langzeitarbeitslosigkeit (LZA-Übertrittsrisiko)"]
[null,null,null,"Das LZA-Übertrittsrisiko bringt zum Ausdruck, wie groß das Risiko ist, nach dem Zugang in Arbeitslosigkeit 12 Monate später langzeitarbeitslos zu werden."]
[]
[]
[]
[]
[]
[]
[]
[]
{"$rows_left_out":21}
{"sheet":"Tab_1","index":1,"n_rows":46,"n_cols":17,"rows_kept":46,"cut":false,"hidden":false,"merged":[[10,11,13,15],[42,12,43,15],[40,12,41,15],[15,11,17,15],[33,11,35,15],[20,11,28,15]]}
[]
[]
[]
[]
[]
[null,null,null,"Übertrittsrisiko in Langzeitarbeitslosigkeit"]
[null,null,null,{"$f":"Steuer!A2","v":"2022 / 2023"}]
[null,null,null,{"$f":"Steuer!C5","v":"Deutschland"}]
[null,null,null,{"$f":"Steuer!J23","v":"Ausgewählte Merkmale: Für die Merkmale Rechtskreis im Zugang, Geschlecht, Alter, Staatsangehörigkeit und Berufsausbildung wurde keine Auswahl getroffen."}]
[null,null,null,"Vergleich über Risikoklassen allen Regionen"]
[null,null,null,null,null,null,null,null,null,null,null,{"$f":"Steuer!J10","v":"Das Risiko für die ausgewählte Merkmalsgruppe in der Region Deutschland liegt bei 14,3%. Bezogen auf alle Regionen und alle Merkmalsgruppen wird das Risiko in die Risikoklasse \"mittel\" eingeordnet."}]
[]
[]
[]
[]
{"$rows_left_out":32}
{"sheet":"Tab_2","index":2,"n_rows":46,"n_cols":15,"rows_kept":46,"cut":false,"hidden":false,"merged":[]}
[]
[]
[]
[]
[]
[null,null,null,"Übertrittsrisiko in Langzeitarbeitslosigkeit nach Alter in Prozent"]
[null,null,null,{"$f":"Steuer!A2","v":"2022 / 2023"}]
[null,null,null,{"$f":"Steuer!C5","v":"Deutschland"}]
[]
[]
[]
[]
[]
[]
[]
{"$rows_left_out":32}
{"sheet":"Tab_3","index":3,"n_rows":46,"n_cols":15,"rows_kept":46,"cut":false,"hidden":false,"merged":[[5,3,5,14]]}
[]
[]
[]
[]
[]
[null,null,null,{"$f":"CONCATENATE(\"Übertrittsrisiko in Langzeitarbeitslosigkeit nach Alter und \",Berufsausbildung!$B$7,\" in Prozent\")","v":"Übertrittsrisiko in Langzeitarbeitslosigkeit nach Alter und Rechtskreis im Zugang in Prozent"}]
[null,null,null,{"$f":"Steuer!A2","v":"2022 / 2023"}]
[null,null,null,{"$f":"Steuer!C5","v":"Deutschland"}]
[]
[]
[]
[]
[]
[]
[]
{"$rows_left_out":32}
{"sheet":"Tab_4","index":4,"n_rows":28,"n_cols":15,"rows_kept":28,"cut":false,"hidden":false,"merged":[[5,3,5,14]]}
[]
[]
[]
[]
[]
[null,null,null,{"$f":"CONCATENATE(\"Übertrittsrisiko in Langzeitarbeitslosigkeit nach Geschlecht und \",Geschlecht!$B$7,\" in Prozent\")","v":"Übertrittsrisiko in Langzeitarbeitslosigkeit nach Geschlecht und Rechtskreis im Zugang in Prozent"}]
[null,null,null,{"$f":"Steuer!A2","v":"2022 / 2023"}]
[null,null,null,{"$f":"Steuer!C5","v":"Deutschland"}]
[]
[]
[]
[]
[]
[]
[]
{"$rows_left_out":14}
{"sheet":"Tab_5","index":5,"n_rows":44,"n_cols":18,"rows_kept":44,"cut":false,"hidden":false,"merged":[[26,12,26,16],[31,12,31,16],[10,12,20,16],[21,12,24,16],[36,12,41,16]]}
[]
[]
[]
[]
[]
[null,null,null,"Langzeitarbeitslosigkeitsrisiko"]
[null,null,null,{"$f":"Steuer!A2","v":"2022 / 2023"}]
[null,null,null,{"$f":"Steuer!C5&\", \"&Steuer!C15","v":"Deutschland, Süddeutschland"}]
[null,null,null,{"$f":"Steuer!J23","v":"Ausgewählte Merkmale: Für die Merkmale Rechtskreis im Zugang, Geschlecht, Alter, Staatsangehörigkeit und Berufsausbildung wurde keine Auswahl getroffen."}]
[null,null,null,{"$f":"CONCATENATE(\"Vergleich über Risikoklassen von \",Steuer!C5,\", \",Steuer!C15,\" und allen Regionen\")","v":"Vergleich über Risikoklassen von Deutschland, Süddeutschland und allen Regionen"}]
[null,null,null,null,null,null,null,null,null,null,null,null,"Die Risikoklassen werden über alle Regionen und für die jeweils ausgewählten Großregionen gebildet. Dazu werden die Merkmalsgruppen über alle oder in der ausgewählten Großregion nach der Höhe des Übertrittsrisikos aufsteigend sortiert und gleichmäßig auf fünf Risikogruppen verteilt. Die Zuordnung zur Risikogruppe kann sich unterscheiden, weil die Risiken in den Regionen unterschiedlich ausfallen: Das Risiko kann z.B. in der ausgewählten Großregion hoch (niedrig), über alle Regionen gesehen aber niedrig (hoch) sein. "]
[]
[]
[]
[]
{"$rows_left_out":30}
{"sheet":"Steuer","index":6,"n_rows":30,"n_cols":16,"rows_kept":30,"cut":false,"hidden":true,"merged":[[0,11,0,15]]}
["Übersicht",null,1,null,2,3,4,5,6,null,null,"Kurzübersicht"]
["2022 / 2023",null,null,null,null,null,null,null,null,"ID","Zeile in Roh","Risk","RiskRech","RiskKlasse","FallZug","FallUeber"]
["AuswahlRegion1",{"$f":"INDEX(CB_Reg_kurz,MATCH($C$5,CB_Reg1,0),1)","v":"BA"},null,null,null,null,null,null,null,"alle Regionen",null,null,null,{"$f":"Berechnung!O30","v":"mittel"}]
["AuswahlRegion2",{"$f":"INDEX(CB_Reg_kurz,MATCH($C$15,CB_Reg2,0),1)","v":"SD"},null,null,null,null,null,null,null,{"$f":"$B$3&D5&F5&G5&H5&I5","v":"BAInsgesamtInsgesamtInsgesamtInsgesamtInsgesamt"},{"$f":"MATCH(J4,Roh!A:A,0)","v":3},{"$f":"INDIRECT(ADDRESS($K4,$L$6,1,1,\"Roh\"))","v":"14,3"},{"$f":"INDIRECT(ADDRESS($K4,$M$6,1,1,\"Roh\"))","v":14.310723443767595},{"$f":"Berechnung!Q30","v":"mittel"},{"$f":"INDIRECT(ADDRESS($K4,$O$6,1,1,\"Roh\"))","v":4594317},{"$f":"INDIRECT(ADDRESS($K4,$P$6,1,1,\"Roh\"))","v":657480}]
["ID",null,"Deutschland",{"$f":"INDEX(CB_RK_kurz,MATCH($E$5,CB_RK,0),1)","v":"Insgesamt"},"Insgesamt","Insgesamt","Insgesamt","Insgesamt","Insgesamt",{"$f":"B4&D5&F5&G5&H5&I5","v":"SDInsgesamtInsgesamtInsgesamtInsgesamtInsgesamt"},{"$f":"MATCH(J5,Roh!A:A,0)","v":651},{"$f":"INDIRECT(ADDRESS($K5,$L$6,1,1,\"Roh\"))","v":"10,8"},{"$f":"INDIRECT(ADDRESS($K5,$M$6,1,1,\"Roh\"))","v":10.813578074837212},{"$f":"Berechnung!S30","v":"mittel"},{"$f":"INDIRECT(ADDRESS($K5,$O$6,1,1,\"Roh\"))","v":1102660},{"$f":"INDIRECT(ADDRESS($K5,$P$6,1,1,\"Roh\"))","v":119237}]
["def. Name","CB_Regkurz","CB_Reg_1","CB_Rkkurz","CB_RK","CB_Geschl","CB_Alter","CB_Staat","CB_BAB","Spalten in Roh",null,4,5,null,2,3]
[null,"BA","Deutschland","Insgesamt","Insgesamt","Insgesamt","Insgesamt","Insgesamt","Insgesamt","MaximalWert",null,null,{"$f":"Berechnung!B3","v":33.400491598501027}]
[null,"SD","Süddeutschland","II","Rechtskreis SGB II","Männlich","15 bis unter 25 Jahre","Deutsche","Keine Berufsausbildung"]
[null,"SWD","Südwestdeutschland","III","Rechtskreis SGB III","Weiblich","25 bis unter 35 Jahre","Ausländer","Betriebliche/schulische Ausbildung","Text Risikoeinordnung"]
[null,"NRW","Nordrhein-Westfalen",null,null,null,"35 bis unter 45 Jahre",null,"Akademische Ausbildung",{"$f":"IFERROR(CONCATENATE(\"Das Risiko für die ausgewählte Merkmalsgruppe in der Region \",C5, \" liegt bei \",TEXT(Berechnung!Q21,\"#0,0\")&IF(Berechnung!Q21=\"k.A.\",\"\",\"%\"), \". Bezogen auf alle Regionen und alle Merkmalsgruppen wird das Risiko in die Risikoklasse \"\"\", N3, \"\"\" eingeordnet.\"),$J$14)","v":"Das Risiko für die ausgewählte Merkmalsgruppe in der Region Deutschland liegt bei 14,3%. Bezogen auf alle Regionen und alle Merkmalsgruppen wird das Risiko in die Risikoklasse \"mittel\" eingeordnet."}]
[null,"ND","Norddeutschland",null,null,null,"45 bis unter 55 Jahre",null,null,{"$f":"IFERROR(CONCATENATE(\"Das Risiko für die ausgewählte Merkmalsgruppe in der Region \",C5,\" liegt bei \",TEXT(Berechnung!Q21,\"#0,0\")&IF(Berechnung!Q21=\"k.A.\",\"\",\"%\"),\". Bezogen auf diese Region wird das Risiko in die Risikoklasse \"\"\", N4, \"\"\" eingeordnet.\"),$J$14)","v":"Das Risiko für die ausgewählte Merkmalsgruppe in der Region Deutschland liegt bei 14,3%. Bezogen auf diese Region wird das Risiko in die Risikoklasse \"mittel\" eingeordnet."}]
[null,"OD","Ostdeutschland",null,null,null,"55 und älter",null,null,{"$f":"IFERROR(CONCATENATE(\"Das Risiko für die ausgewählte Merkmalsgruppe in der Region \",C15,\" liegt bei \",TEXT(Berechnung!S21,\"#0,0\")&IF(Berechnung!S21=\"k.A.\",\"\",\"%\"),\". Bezogen auf diese Region wird das Risiko in die Risikoklasse \"\"\",N5,\"\"\" eingeordnet.\"),$J$14)","v":"Das Risiko für die ausgewählte Merkmalsgruppe in der Region Süddeutschland liegt bei 10,8%. Bezogen auf diese Region wird das Risiko in die Risikoklasse \"mittel\" eingeordnet."}]
[]
[null,null,null,null,null,null,null,null,null,"Für die Region kann auf Grund des Datenschutzes oder einer zu geringen Fallzahl der Zugänge kein Risiko ermittelt werden."]
[null,null,"Süddeutschland"]
{"$rows_left_out":16}
{"sheet":"Roh","index":7,"n_rows":3890,"n_cols":5,"rows_kept":3890,"cut":false,"hidden":true,"merged":[]}
[]
["ID\nRegRKGeschlAlterStaatBAB","Zug<20_DS","Ueb_DS","RiskAusg","RiskRech"]
["BAInsgesamtInsgesamtInsgesamtInsgesamtInsgesamt",4594317,657480,"14,3",14.310723443767595]
["BAInsgesamtInsgesamtInsgesamtInsgesamtKeine Berufsausbildung",2457103,386555,"15,7",15.73214472490571]
["BAInsgesamtInsgesamtInsgesamtInsgesamtBetriebliche/schulische Ausbildung",1609334,217646,"13,5",13.52397948468124]
["BAInsgesamtInsgesamtInsgesamtInsgesamtAkademische Ausbildung",527880,53279,"10,1",10.093013563688718]
["BAInsgesamtInsgesamtInsgesamtDeutscheInsgesamt",2828920,403959,"14,3",14.279619077245027]
["BAInsgesamtInsgesamtInsgesamtDeutscheKeine Berufsausbildung",1096112,181740,"16,6",16.580422438582918]
["BAInsgesamtInsgesamtInsgesamtDeutscheBetriebliche/schulische Ausbildung",1390222,189331,"13,6",13.618760169239158]
["BAInsgesamtInsgesamtInsgesamtDeutscheAkademische Ausbildung",342586,32888,"9,6",9.5999252742377106]
["BAInsgesamtInsgesamtInsgesamtAusländerInsgesamt",1765376,253520,"14,4",14.360680104408353]
["BAInsgesamtInsgesamtInsgesamtAusländerKeine Berufsausbildung",1360973,204814,"15,0",15.049086205236989]
["BAInsgesamtInsgesamtInsgesamtAusländerBetriebliche/schulische Ausbildung",219110,28315,"12,9",12.922732873898953]
["BAInsgesamtInsgesamtInsgesamtAusländerAkademische Ausbildung",185293,20391,"11,0",11.004733044421537]
["BAInsgesamtInsgesamt15 bis unter 25 JahreInsgesamtInsgesamt",742861,51698,"7,0",6.9593100189672086]
{"$rows_left_out":3876}
{"sheet":"Berechnung","index":8,"n_rows":644,"n_cols":24,"rows_kept":644,"cut":false,"hidden":true,"merged":[[4,12,4,18],[1,2,1,8],[0,13,0,19]]}
[null,null,null,null,null,null,null,null,null,null,null,null,null,"RohDaten Diagramm"]
[null,null,"RiskRech_pDS",null,null,null,null,null,null,null,null,null,null,null,null,null,"Region1",null,"Region2"]
["Max_Alle",33.400491598501027,"AlleoBA","BA","SD","SWD","NRW","ND","OD",null,"Spalte Wverweis",null,null,null,"Alle Regionen\n(außer BA)",null,{"$f":"Steuer!B3","v":"BA"},null,{"$f":"Steuer!B4","v":"SD"}]
["n KlassenBer",120,593,120,119,118,118,119,119,null,2,null,"n=Anzahl Merkmalskombination für Analyse",null,{"$f":"C4","v":593},null,{"$f":"HLOOKUP($Q$3,$D$3:$I$18,$K4,0)","v":120},null,{"$f":"HLOOKUP($S$3,$D$3:$I$18,$K4,0)","v":119}]
[null,"Max",33.400491598501027,29.284064665127019,29.25409205756344,31.911663216011043,33.400491598501027,32.837301587301589,32.480314960629919,null,null,null,"Quintile zur Berechung der Risikoklassen"]
[0.8,"4. Quintil",22.258609627679853,21.730014614558684,18.644445235855681,22.048412316708987,24.950066704995219,22.573338778941991,21.796385027752741,null,3,null,"Max",null,{"$f":"C5","v":33.400491598501027},null,{"$f":"HLOOKUP($Q$3,$D$3:$I$18,$K6,0)","v":29.284064665127019},null,{"$f":"HLOOKUP($S$3,$D$3:$I$18,$K6,0)","v":29.25409205756344}]
[0.6,"3. Quintil",17.16536554113376,17.164193681118313,13.680931187949332,17.501150940019027,20.368580596794075,18.079001632013707,16.469795745542555,null,4,0.8,"4. Quintil",null,22.258609627679853,null,21.730014614558684,null,{"$f":"HLOOKUP($S$3,$D$3:$I$18,$K7,0)","v":18.644445235855681}]
[0.4,"2. Quintil",9.8645972707894742,9.2944824470326974,6.7000502830363589,9.2314399176542246,12.527172627221111,9.5867090329944418,11.237947753627196,null,5,0.6,"3. Quintil",null,17.16536554113376,null,17.164193681118313,null,13.680931187949332]
[0.2,"1. Quintil",6.5938606538622242,6.9262414403267289,5.0337652272097149,6.4866285650925191,8.8326021115205595,7.1449901664792046,7.1905584913473426,null,6,0.4,"2. Quintil",null,9.8645972707894742,null,9.2944824470326974,null,6.7000502830363589]
[null,"Min",0,0,0,0,0,0,0,null,7,0.2,"1. Quintil",null,6.5938606538622242,null,6.9262414403267289,null,5.0337652272097149]
[null,null,null,null,null,null,null,null,null,null,8,null,"Min",null,0,null,0,null,0]
["sehr hoch","Max",11.141881970821174,7.5540500505683355,10.609646821707759,9.8632508993020558,8.4504248935058079,10.263962808359597,10.683929932877177]
["hoch","4. Quintil",5.0932440865460933,4.5658209334403708,4.9635140479063491,4.5472613766899599,4.581486108201144,4.4943371469282845,5.3265892822101861,null,10,"sehr hoch","Max",null,{"$f":"C12","v":11.141881970821174},null,{"$f":"HLOOKUP($Q$3,$D$3:$I$18,$K13,0)","v":7.5540500505683355},null,{"$f":"S6-S7","v":10.609646821707759}]
["mittel","3. Quintil",7.3007682703442853,7.8697112340856155,6.980880904912973,8.2697110223648025,7.8414079695729644,8.4922925990192653,5.2318479919153589,null,11,"hoch","4. Quintil",null,5.0932440865460933,null,4.5658209334403708,null,4.9635140479063491]
["niedrig","2. Quintil",3.27073661692725,2.3682410067059685,1.666285055826644,2.7448113525617055,3.6945705157005513,2.4417188665152372,4.0473892622798537,null,12,"mittel","3. Quintil",null,7.3007682703442853,null,7.8697112340856155,null,6.980880904912973]
{"$rows_left_out":630}
{"sheet":"Merkmale","index":9,"n_rows":40,"n_cols":15,"rows_kept":40,"cut":false,"hidden":true,"merged":[]}
["Region1",{"$f":"Steuer!B3","v":"BA"},null,null,null,null,null,null,null,null,null,"Daten",{"$f":"Steuer!M6","v":5}]
["Diagramm Berufsausbildung"]
["CB_RK","CB_Geschl","CB_Alter","CB_Staat","CB_BAB"]
[2,3,4,5,6]
[null,null,null,null,"Insgesamt","Keine Berufsausbildung","Betriebliche/schulische Ausbildung","Akademische Ausbildung",null,null,null,"Insgesamt","Keine Berufsausb.","Betriebl./schul. Ausbild.","Akadem. Ausbild."]
["Insgesamt","Insgesamt","15 bis unter 25 Jahre","Insgesamt",{"$f":"$B$1&$A6&$B6&$C6&$D6&E$5","v":"BAInsgesamtInsgesamt15 bis unter 25 JahreInsgesamtInsgesamt"},{"$f":"$B$1&$A6&$B6&$C6&$D6&F$5","v":"BAInsgesamtInsgesamt15 bis unter 25 JahreInsgesamtKeine Berufsausbildung"},"BAInsgesamtInsgesamt15 bis unter 25 JahreInsgesamtBetriebliche/schulische Ausbildung","BAInsgesamtInsgesamt15 bis unter 25 JahreInsgesamtAkademische Ausbildung","BAInsgesamtInsgesamt15 bis unter 25 JahreInsgesamt",null,"15 bis\nunter 25",{"$f":"ROUND(VLOOKUP(E6,Roh!$A$3:$E$4538,$M$1,0),1)","v":7},{"$f":"ROUND(VLOOKUP(F6,Roh!$A$3:$E$4538,$M$1,0),1)","v":8.4},{"$f":"ROUND(VLOOKUP(G6,Roh!$A$3:$E$4538,$M$1,0),1)","v":3.2},{"$f":"ROUND(VLOOKUP(H6,Roh!$A$3:$E$4538,$M$1,0),1)","v":3.7}]
["Insgesamt","Insgesamt","25 bis unter 35 Jahre","Insgesamt",{"$f":"$B$1&$A7&$B7&$C7&$D7&E$5","v":"BAInsgesamtInsgesamt25 bis unter 35 JahreInsgesamtInsgesamt"},"BAInsgesamtInsgesamt25 bis unter 35 JahreInsgesamtKeine Berufsausbildung","BAInsgesamtInsgesamt25 bis unter 35 JahreInsgesamtBetriebliche/schulische Ausbildung","BAInsgesamtInsgesamt25 bis unter 35 JahreInsgesamtAkademische Ausbildung","BAInsgesamtInsgesamt25 bis unter 35 JahreInsgesamt",null,"25 bis\nunter 35",{"$f":"ROUND(VLOOKUP(E7,Roh!$A$3:$E$4538,$M$1,0),1)","v":12.2},{"$f":"ROUND(VLOOKUP(F7,Roh!$A$3:$E$4538,$M$1,0),1)","v":16},{"$f":"ROUND(VLOOKUP(G7,Roh!$A$3:$E$4538,$M$1,0),1)","v":9.3000000000000007},{"$f":"ROUND(VLOOKUP(H7,Roh!$A$3:$E$4538,$M$1,0),1)","v":5.7}]
["Insgesamt","Insgesamt","35 bis unter 45 Jahre","Insgesamt","BAInsgesamtInsgesamt35 bis unter 45 JahreInsgesamtInsgesamt","BAInsgesamtInsgesamt35 bis unter 45 JahreInsgesamtKeine Berufsausbildung","BAInsgesamtInsgesamt35 bis unter 45 JahreInsgesamtBetriebliche/schulische Ausbildung","BAInsgesamtInsgesamt35 bis unter 45 JahreInsgesamtAkademische Ausbildung","BAInsgesamtInsgesamt35 bis unter 45 JahreInsgesamt",null,"35 bis\nunter 45",{"$f":"ROUND(VLOOKUP(E8,Roh!$A$3:$E$4538,$M$1,0),1)","v":14.6},{"$f":"ROUND(VLOOKUP(F8,Roh!$A$3:$E$4538,$M$1,0),1)","v":17.399999999999999},{"$f":"ROUND(VLOOKUP(G8,Roh!$A$3:$E$4538,$M$1,0),1)","v":12.5},{"$f":"ROUND(VLOOKUP(H8,Roh!$A$3:$E$4538,$M$1,0),1)","v":9.1}]
["Insgesamt","Insgesamt","45 bis unter 55 Jahre","Insgesamt","BAInsgesamtInsgesamt45 bis unter 55 JahreInsgesamtInsgesamt","BAInsgesamtInsgesamt45 bis unter 55 JahreInsgesamtKeine Berufsausbildung","BAInsgesamtInsgesamt45 bis unter 55 JahreInsgesamtBetriebliche/schulische Ausbildung","BAInsgesamtInsgesamt45 bis unter 55 JahreInsgesamtAkademische Ausbildung","BAInsgesamtInsgesamt45 bis unter 55 JahreInsgesamt",null,"45 bis\nunter 55",{"$f":"ROUND(VLOOKUP(E9,Roh!$A$3:$E$4538,$M$1,0),1)","v":15.1},{"$f":"ROUND(VLOOKUP(F9,Roh!$A$3:$E$4538,$M$1,0),1)","v":17.399999999999999},{"$f":"ROUND(VLOOKUP(G9,Roh!$A$3:$E$4538,$M$1,0),1)","v":13.1},{"$f":"ROUND(VLOOKUP(H9,Roh!$A$3:$E$4538,$M$1,0),1)","v":11.1}]
["Insgesamt","Insgesamt","55 und älter","Insgesamt","BAInsgesamtInsgesamt55 und älterInsgesamtInsgesamt","BAInsgesamtInsgesamt55 und älterInsgesamtKeine Berufsausbildung","BAInsgesamtInsgesamt55 und älterInsgesamtBetriebliche/schulische Ausbildung","BAInsgesamtInsgesamt55 und älterInsgesamtAkademische Ausbildung","BAInsgesamtInsgesamt55 und älterInsgesamt",null,"55 und \nälter",{"$f":"ROUND(VLOOKUP(E10,Roh!$A$3:$E$4538,$M$1,0),1)","v":23.7},{"$f":"ROUND(VLOOKUP(F10,Roh!$A$3:$E$4538,$M$1,0),1)","v":22.2},{"$f":"ROUND(VLOOKUP(G10,Roh!$A$3:$E$4538,$M$1,0),1)","v":24.8},{"$f":"ROUND(VLOOKUP(H10,Roh!$A$3:$E$4538,$M$1,0),1)","v":24.3}]
[]
["Diagramm Geschlecht"]
["CB_RK","CB_Alter","CB_Staat","CB_BAB","CB_Geschl"]
[2,4,5,6,3]
[null,null,null,null,"Insgesamt","Männlich","Weiblich",null,null,null,null,"Insgesamt","Männlich","Weiblich"]
{"$rows_left_out":26}
{"sheet":"Berufsausbildung","index":10,"n_rows":48,"n_cols":14,"rows_kept":48,"cut":false,"hidden":true,"merged":[]}
["Region1",{"$f":"Steuer!B3","v":"BA"},null,null,null,null,null,null,"Daten",{"$f":"Steuer!M6","v":5}]
["Auswahlmöglichkeiten",null,null,null,null,null,null,null,null,null,null,"CB_RK","CB_Geschl","CB_Staat"]
[false,"Geschlecht",null,"Männlich","Weiblich","CB_Geschl",3,null,null,null,null,2,3,5]
[false,"Staatsangehörigkeit",null,"Deutsche","Ausländer","CB_Staat",5]
[true,"Rechtskreis im Zugang",null,"II","III","CB_RK",2,null,null,null,null,"Insgesamt","Insgesamt","Insgesamt"]
["Auswahl"]
[true,{"$f":"VLOOKUP($A$7,$A$3:$G$5,COLUMN(),0)","v":"Rechtskreis im Zugang"},null,{"$f":"VLOOKUP($A$7,$A$3:$G$5,COLUMN(),0)","v":"II"},{"$f":"VLOOKUP($A$7,$A$3:$G$5,COLUMN(),0)","v":"III"},"CB_RK",2]
[]
[]
["Diagramm Berufsausbildung - Insgesamt",null,null,"CB_BAB","Insgesamt"]
[null,null,null,"CB_Alter",{"$f":"$F$7","v":"CB_RK"}]
[null,null,null,4,{"$f":"$G$7","v":2}]
[null,null,null,null,{"$f":"D7","v":"II"},{"$f":"E7","v":"III"},null,null,{"$f":"IF(D7=\"II\",\"Rechtskreis SGB II\",D7)","v":"Rechtskreis SGB II"},{"$f":"IF(E7=\"III\",\"Rechtskreis SGB III\",E7)","v":"Rechtskreis SGB III"}]
[null,null,null,"15 bis unter 25 Jahre",{"$f":"IF($G$7=3,$B$1&$L$5&E$13&$D14&$N$5&$E$10,IF($G$7=2,$B$1&E$13&$M$5&$D14&$N$5&$E$10,$B$1&$L$5&$M$5&$D14&E$13&$E$10))","v":"BAIIInsgesamt15 bis unter 25 JahreInsgesamtInsgesamt"},{"$f":"IF($G$7=3,$B$1&$L$5&F$13&$D14&$N$5&$E$10,IF($G$7=2,$B$1&F$13&$M$5&$D14&$N$5&$E$10,$B$1&$L$5&$M$5&$D14&F$13&$E$10))","v":"BAIIIInsgesamt15 bis unter 25 JahreInsgesamtInsgesamt"},null,"15 bis\nunter 25",{"$f":"ROUND(VLOOKUP(E14,Roh!$A$3:$E$4538,$J$1,0),1)","v":10.8},{"$f":"ROUND(VLOOKUP(F14,Roh!$A$3:$E$4538,$J$1,0),1)","v":3.1}]
[null,null,null,"25 bis unter 35 Jahre",{"$f":"IF($G$7=3,$B$1&$L$5&E$13&$D15&$N$5&$E$10,IF($G$7=2,$B$1&E$13&$M$5&$D15&$N$5&$E$10,$B$1&$L$5&$M$5&$D15&E$13&$E$10))","v":"BAIIInsgesamt25 bis unter 35 JahreInsgesamtInsgesamt"},"BAIIIInsgesamt25 bis unter 35 JahreInsgesamtInsgesamt",null,"25 bis\nunter 35",{"$f":"ROUND(VLOOKUP(E15,Roh!$A$3:$E$4538,$J$1,0),1)","v":19.3},{"$f":"ROUND(VLOOKUP(F15,Roh!$A$3:$E$4538,$J$1,0),1)","v":6.1}]
{"$rows_left_out":34}
{"sheet":"Geschlecht","index":11,"n_rows":34,"n_cols":15,"rows_kept":34,"cut":false,"hidden":true,"merged":[]}
["Region1",{"$f":"Steuer!B3","v":"BA"},null,null,null,null,null,null,null,"Daten",{"$f":"Steuer!M6","v":5}]
["Auswahlmöglichkeiten",null,null,null,{"$f":"LEN(E3)","v":34},null,null,null,null,null,null,null,"CB_RK","CB_Staat","CB_BAB"]
[false,"Berufsausbildung",null,"Keine Berufsausbildung","Betriebliche/schulische Ausbildung","Akademische Ausbildung","CB_Geschl",6,35,null,null,null,2,5,6]
[false,"Staatsangehörigkeit",null,"Deutsche","Ausländer",{"$f":"NA()","v":{"$error":"#N/A"}},"CB_Staat",5,37]
[true,"Rechtskreis im Zugang",null,"II","III",{"$f":"NA()","v":{"$error":"#N/A"}},"CB_RK",2,36,null,null,null,"Insgesamt","Insgesamt","Insgesamt"]
["Auswahl"]
[true,{"$f":"VLOOKUP($A$7,$A$3:$I$5,COLUMN(),0)","v":"Rechtskreis im Zugang"},null,{"$f":"VLOOKUP($A$7,$A$3:$I$5,COLUMN(),0)","v":"II"},"III",{"$error":"#N/A"},"CB_RK",2,36]
[]
[]
["Diagramm Männer",null,null,"CB_Geschl","Männlich"]
[null,null,null,"CB_Alter",{"$f":"$G$7","v":"CB_RK"}]
[null,null,null,4,{"$f":"$H$7","v":2}]
[null,null,null,null,{"$f":"D7","v":"II"},{"$f":"E7","v":"III"},{"$f":"F7","v":{"$error":"#N/A"}},null,null,{"$f":"IF($D$7=\"II\",\"Rechtskreis SGB II\",$D$7)&REPT(\"  \",$E$2-LEN(IF($D$7=\"II\",\"Rechtskreis SGB II\",$D$7)))","v":"Rechtskreis SGB II                                "},{"$f":"IF($E$7=\"III\",\"Rechtskreis SGB III\",$E$7)&REPT(\" \",$E$2-LEN(IF($E$7=\"III\",\"Rechtskreis SGB III\",$E$7)))","v":"Rechtskreis SGB III               "},{"$f":"$F$7&REPT(\" \",$E$2-LEN(F7))","v":{"$error":"#N/A"}}]
[null,null,null,"15 bis unter 25 Jahre",{"$f":"IF($H$7=2,$B$1&E$13&$E$10&$D14&$N$5&$O$5,IF($H$7=5,$B$1&$M$5&$E$10&$D14&E$13&$O$5,$B$1&$M$5&$E$10&$D14&$N$5&E$13))","v":"BAIIMännlich15 bis unter 25 JahreInsgesamtInsgesamt"},{"$f":"IF($H$7=2,$B$1&F$13&$E$10&$D14&$N$5&$O$5,IF($H$7=5,$B$1&$M$5&$E$10&$D14&F$13&$O$5,$B$1&$M$5&$E$10&$D14&$N$5&F$13))","v":"BAIIIMännlich15 bis unter 25 JahreInsgesamtInsgesamt"},{"$error":"#N/A"},null,"15 bis\nunter 25",{"$f":"ROUND(VLOOKUP(E14,Roh!$A$3:$E$4538,$K$1,0),1)","v":11.5},{"$f":"ROUND(VLOOKUP(F14,Roh!$A$3:$E$4538,$K$1,0),1)","v":3.3},{"$f":"ROUND(VLOOKUP(G14,Roh!$A$3:$E$4538,$K$1,0),1)","v":{"$error":"#N/A"}}]
[null,null,null,"25 bis unter 35 Jahre",{"$f":"IF($H$7=2,$B$1&E$13&$E$10&$D15&$N$5&$O$5,IF($H$7=5,$B$1&$M$5&$E$10&$D15&E$13&$O$5,$B$1&$M$5&$E$10&$D15&$N$5&E$13))","v":"BAIIMännlich25 bis unter 35 JahreInsgesamtInsgesamt"},"BAIIIMännlich25 bis unter 35 JahreInsgesamtInsgesamt",{"$error":"#N/A"},null,"25 bis\nunter 35",{"$f":"ROUND(VLOOKUP(E15,Roh!$A$3:$E$4538,$K$1,0),1)","v":19.7},{"$f":"ROUND(VLOOKUP(F15,Roh!$A$3:$E$4538,$K$1,0),1)","v":6.5},{"$f":"ROUND(VLOOKUP(G15,Roh!$A$3:$E$4538,$K$1,0),1)","v":{"$error":"#N/A"}}]
{"$rows_left_out":19}